{"text_format":"1","workbook":"xlsx","n_sheets":6,"sheets":["Warning","LCC","Diagram","Fuel Prices","Calculations","Bugs"],"not_rendered":{"charts":2,"images":3,"macros":1,"external_links":0,"defined_names":7,"comments":0,"pivot_tables":0},"unopened":[],"bounds":{"document_bytes":16777216,"sheet_cells":100000,"rows_first":2000,"rows_last":500,"rows_between":2000,"halvings":0,"cell_chars":16384,"cell_head_chars":4096},"cells_cut":0,"cells_raw":0,"read":"whole","date_system":"1900"}

{"sheet":"Warning","index":0,"n_rows":33,"n_cols":8,"rows_kept":33,"cut":false,"hidden":false,"merged":[[32,6,33,12],[16,3,16,15],[19,5,27,13]]}
[]
[]
[]
[]
[]
[]
[]
[]
[]
[]
[]
[null,null,null,null,null,null,null,"Life Cycle Cost Calculator"]
[]
[]
[]
{"$rows_left_out":19}
{"sheet":"LCC","index":1,"n_rows":99,"n_cols":13,"rows_kept":99,"cut":false,"hidden":true,"merged":[[60,2,60,3],[61,2,61,3],[60,27,60,28],[54,27,54,28],[55,27,55,28],[56,27,56,28],[59,27,59,28]]}
[]
[null,null,null,"VEHICLES - LIFE CYCLE COST (LCC) CALCULATOR"]
[null,null,null,"Please fill in the white cells only - use European number formats (commas for decimals, dots for thousands)"]
[]
[null,"GENERAL CONDITIONS"]
[null,null,"Contract length/period of vehicle ownership","Year",10,null,{"$f":"E6","v":10},null,{"$f":"E6","v":10},null,{"$f":"E6","v":10},null,{"$f":"E6","v":10}]
[null,null,"Discount rate ","%",2,null,{"$f":"E7","v":2},null,{"$f":"E7","v":2},null,{"$f":"E7","v":2},null,{"$f":"E7","v":2}]
[null,null,"Number of bids/offers",null,3]
[]
[null,"ACQUISITION COSTS"]
[null,null,"Name of bidder",null,"Product A",null,"Product B",null,"Product C",null,"Product 4",null,"Product 5"]
[]
[null,null,"Number of vehicles",null,10,null,10,null,10,null,50,null,50]
[null,null,"Purchase price","€/unit",10000,"€/unit",10000,"€/unit",null,"€/unit",null,"€/unit",30000]
[null,null,"(or) Lease price","€/unit/year",null,"€/unit/year",null,"€/unit/year",1000,"€/unit/year",6800,"€/unit/year"]
{"$rows_left_out":85}
{"sheet":"Diagram","index":2,"n_rows":27,"n_cols":23,"rows_kept":27,"cut":false,"hidden":true,"merged":[[2,1,2,17],[26,3,26,5],[27,3,27,6]]}
[]
[]
[null,"LCC RESULTS DIAGRAM"]
[]
[]
[]
[]
[]
[]
[null,null,null,null,null,null,null,null,null,null,null,null,null,null,null,null,null,null,null,null,null,null,"Operational lifetime costs"]
[]
[null,null,null,null,null,null,null,null,null,null,null,null,null,null,null,null,null,null,null,null,null,null,"Fuel costs"]
[]
[null,null,null,null,null,null,null,null,null,null,null,null,null,null,null,null,null,null,null,null,null,null,"Total other costs"]
[]
{"$rows_left_out":13}
{"sheet":"Fuel Prices","index":3,"n_rows":57,"n_cols":28,"rows_kept":57,"cut":false,"hidden":true,"merged":[[39,1,40,1],[27,1,28,1],[29,1,30,1],[31,1,32,1],[33,1,34,1],[35,1,36,1],[37,1,38,1]]}
[]
[null,null,null,null,null,null,null,null,"5 YEARS",null,null,null,null,"10 YEARS"]
[null,null,null,2014,2015,2016,2017,2018,2019,2020,2021,2022,2023,2024,null,"DIESEL",2014,2015,2016,2017,2018,2019,2020,2021,2022,2023,2024,"Total fuel price for period"]
["Diesel ","$/gallon","Forecasted price",3.6833300000000002,3.5441319999999998,3.4952230000000002,3.4971399999999999,3.533868,3.6106159999999998,3.671875,3.7407020000000002,3.815766,3.868004,3.9180830000000002,null,"Product 1",{"$f":"((LCC!$E$21*(LCC!$E$20/100))*LCC!$E$22)","v":1575},{"$f":"((LCC!$E$21*(LCC!$E$20/100))*(LCC!$E$22*(1+$E$6)))","v":1515.4786293924244},{"$f":"((LCC!$E$21*(LCC!$E$20/100))*(LCC!$E$22*(1+$F$6)))","v":1493.7436389913901},{"$f":"((LCC!$E$21*(LCC!$E$20/100))*(LCC!$E$22*(1+$G$6)))","v":1494.607467994575},{"$f":"((LCC!$E$21*(LCC!$E$20/100))*(LCC!$E$22*(1+$H$6)))","v":1511.1485844497358},{"$f":"((LCC!$E$21*(LCC!$E$20/100))*(LCC!$E$22*(1+$I$6)))","v":1545.3541914503367},{"$f":"((LCC!$E$21*(LCC!$E$20/100))*(LCC!$E$22*(1+$J$6)))","v":1572.0762037053091},{"$f":"((LCC!$E$21*(LCC!$E$20/100))*(LCC!$E$22*(1+$K$6)))","v":1601.5985934925434},{"$f":"((LCC!$E$21*(LCC!$E$20/100))*(LCC!$E$22*(1+$L$6)))","v":1633.2038376419032},{"$f":"((LCC!$E$21*(LCC!$E$20/100))*(LCC!$E$22*(1+$M$6)))","v":1654.7656551118423},{"$f":"((LCC!$E$21*(LCC!$E$20/100))*(LCC!$E$22*(1+$N$6)))","v":1675.1571606532023},{"$f":"SUM(Q4:INDEX(Q4:AA4,LCC!$E$6))","v":15596.97680223006}]
[null,null,"% against previous yr",null,{"$f":"(E4-D4)/D4","v":-3.779134641750817E-2},{"$f":"(F4-E4)/E4","v":-1.3799993905418773E-2},5.4846285916513031E-4,1.0502296162006696E-2,2.1717845714667276E-2,1.6966356987284215E-2,1.8744374468085159E-2,2.0066821682133404E-2,1.3690042838056634E-2,1.2946987645307556E-2,null,"Product 2",{"$f":"((LCC!$G$21*(LCC!$G$20/100))*LCC!$G$22)","v":48.75},{"$f":"((LCC!$G$21*(LCC!$G$20/100))*(LCC!$G$22*(1+$E$6)))","v":46.907671862146479},{"$f":"((LCC!$G$21*(LCC!$G$20/100))*(LCC!$G$22*(1+$F$6)))","v":46.234922159257316},{"$f":"((LCC!$G$21*(LCC!$G$20/100))*(LCC!$G$22*(1+$G$6)))","v":46.261659723641614},{"$f":"((LCC!$G$21*(LCC!$G$20/100))*(LCC!$G$22*(1+$H$6)))","v":46.773646661539445},{"$f":"((LCC!$G$21*(LCC!$G$20/100))*(LCC!$G$22*(1+$I$6)))","v":47.832391640129472},{"$f":"((LCC!$G$21*(LCC!$G$20/100))*(LCC!$G$22*(1+$J$6)))","v":48.65950154325958},{"$f":"((LCC!$G$21*(LCC!$G$20/100))*(LCC!$G$22*(1+$K$6)))","v":49.57328979857872},{"$f":"((LCC!$G$21*(LCC!$G$20/100))*(LCC!$G$22*(1+$L$6)))","v":50.551547355582727},{"$f":"((LCC!$G$21*(LCC!$G$20/100))*(LCC!$G$22*(1+$M$6)))","v":51.218936943937983},{"$f":"((LCC!$G$21*(LCC!$G$20/100))*(LCC!$G$22*(1+$N$6)))","v":51.850102591646731},{"$f":"SUM(Q5:INDEX(Q5:AA5,LCC!$G$6))","v":482.76356768807335}]
[null,null,"% cumulative",null,{"$f":"E5","v":-3.779134641750817E-2},{"$f":"F5+E6","v":-5.1591340322926942E-2},{"$f":"G5+F6","v":-5.1042877463761814E-2},-4.054058130175512E-2,-1.8822735587087844E-2,-1.8563785998036292E-3,1.6887995868281529E-2,3.6954817550414937E-2,5.0644860388471574E-2,6.3591848033779125E-2,null,"Product 3",{"$f":"((LCC!$I$21*(LCC!$I$20/100))*LCC!$I$22)","v":1435.5000000000002},{"$f":"((LCC!$I$21*(LCC!$I$20/100))*(LCC!$I$22*(1+$E$6)))","v":1381.2505222176671},{"$f":"((LCC!$I$21*(LCC!$I$20/100))*(LCC!$I$22*(1+$F$6)))","v":1361.4406309664384},{"$f":"((LCC!$I$21*(LCC!$I$20/100))*(LCC!$I$22*(1+$G$6)))","v":1362.2279494007701},{"$f":"((LCC!$I$21*(LCC!$I$20/100))*(LCC!$I$22*(1+$H$6)))","v":1377.3039955413308},{"$f":"((LCC!$I$21*(LCC!$I$20/100))*(LCC!$I$22*(1+$I$6)))","v":1408.4799630647356},{"$f":"((LCC!$I$21*(LCC!$I$20/100))*(LCC!$I$22*(1+$J$6)))","v":1432.8351685199823},{"$f":"((LCC!$I$21*(LCC!$I$20/100))*(LCC!$I$22*(1+$K$6)))","v":1459.7427180689183},{"$f":"((LCC!$I$21*(LCC!$I$20/100))*(LCC!$I$22*(1+$L$6)))","v":1488.5486405936206},{"$f":"((LCC!$I$21*(LCC!$I$20/100))*(LCC!$I$22*(1+$M$6)))","v":1508.200697087651},{"$f":"((LCC!$I$21*(LCC!$I$20/100))*(LCC!$I$22*(1+$N$6)))","v":1526.7860978524902},{"$f":"SUM(Q6:INDEX(Q6:AA6,LCC!$I$6))","v":14215.530285461115}]
["Petrol","$/gallon","Forecasted price",3.3808379999999998,3.1774,3.0719460000000001,3.0273970000000001,3.0207419999999998,3.0347240000000002,3.077188,3.1208870000000002,3.1696469999999999,3.220602,3.261647,null,"Product 4",{"$f":"((LCC!$K$21*(LCC!$K$20/100))*LCC!$K$22)","v":1700},{"$f":"((LCC!$K$21*(LCC!$K$20/100))*(LCC!$K$22*(1+$E$6)))","v":1635.7547110902362},{"$f":"((LCC!$K$21*(LCC!$K$20/100))*(LCC!$K$22*(1+$F$6)))","v":1612.2947214510241},{"$f":"((LCC!$K$21*(LCC!$K$20/100))*(LCC!$K$22*(1+$G$6)))","v":1613.227108311605},{"$f":"((LCC!$K$21*(LCC!$K$20/100))*(LCC!$K$22*(1+$H$6)))","v":1631.0810117870162},{"$f":"((LCC!$K$21*(LCC!$K$20/100))*(LCC!$K$22*(1+$I$6)))","v":1668.0013495019507},{"$f":"((LCC!$K$21*(LCC!$K$20/100))*(LCC!$K$22*(1+$J$6)))","v":1696.8441563803337},{"$f":"((LCC!$K$21*(LCC!$K$20/100))*(LCC!$K$22*(1+$K$6)))","v":1728.7095929760785},{"$f":"((LCC!$K$21*(LCC!$K$20/100))*(LCC!$K$22*(1+$L$6)))","v":1762.8231898357051},{"$f":"((LCC!$K$21*(LCC!$K$20/100))*(LCC!$K$22*(1+$M$6)))","v":1786.0962626604016},{"$f":"((LCC!$K$21*(LCC!$K$20/100))*(LCC!$K$22*(1+$N$6)))","v":1808.1061416574244},{"$f":"SUM(Q7:INDEX(Q7:AA7,LCC!$K$6))","v":16834.832103994351}]
[null,null,"%against previous yr",null,{"$f":"(E7-D7)/D7","v":-6.0173838557186062E-2},{"$f":"(F7-E7)/E7","v":-3.3188770693019433E-2},-1.4501882520070323E-2,-2.1982581075426512E-3,4.62866408319558E-3,1.3992705761710071E-2,1.4200952298007191E-2,1.5623763372400118E-2,1.6075922650061691E-2,1.2744511740351648E-2," ","Product 5",{"$f":"((LCC!$M$21*(LCC!$M$20/100))*LCC!$M$22)","v":330},{"$f":"((LCC!$M$21*(LCC!$M$20/100))*(LCC!$M$22*(1+$E$6)))","v":317.52885568222229},{"$f":"((LCC!$M$21*(LCC!$M$20/100))*(LCC!$M$22*(1+$F$6)))","v":312.9748576934341},{"$f":"((LCC!$M$21*(LCC!$M$20/100))*(LCC!$M$22*(1+$G$6)))","v":313.15585043695859},{"$f":"((LCC!$M$21*(LCC!$M$20/100))*(LCC!$M$22*(1+$H$6)))","v":316.62160817042081},{"$f":"((LCC!$M$21*(LCC!$M$20/100))*(LCC!$M$22*(1+$I$6)))","v":323.78849725626105},{"$f":"((LCC!$M$21*(LCC!$M$20/100))*(LCC!$M$22*(1+$J$6)))","v":329.3873950620648},{"$f":"((LCC!$M$21*(LCC!$M$20/100))*(LCC!$M$22*(1+$K$6)))","v":335.57303863653283},{"$f":"((LCC!$M$21*(LCC!$M$20/100))*(LCC!$M$22*(1+$L$6)))","v":342.19508979163692},{"$f":"((LCC!$M$21*(LCC!$M$20/100))*(LCC!$M$22*(1+$M$6)))","v":346.71280392819557},{"$f":"((LCC!$M$21*(LCC!$M$20/100))*(LCC!$M$22*(1+$N$6)))","v":350.98530985114712},{"$f":"SUM(Q8:INDEX(Q8:AA8,LCC!$M$6))","v":3267.9379966577267}]
[null,null,"%cumulative",null,{"$f":"E8","v":-6.0173838557186062E-2},{"$f":"F8+E9","v":-9.3362609250205494E-2},{"$f":"G8+F9","v":-0.10786449177027582},-0.11006274987781847,-0.10543408579462289,-9.1441380032912828E-2,-7.7240427734905637E-2,-6.161666436250552E-2,-4.5540741712443829E-2,-3.2796229972092181E-2]
["LPG","$/gallon","Forecasted price",2.1892990000000001,2.1427740000000002,2.1454360000000001,2.1942110000000001,2.2315330000000002,2.2541479999999998,2.2695509999999999,2.294362,2.3139639999999999,2.328557,2.3463189999999998,null,"PETROL",2014,2015,2016,2017,2018,2019,2020,2021,2022,2023,2024,"Total fuel price for period"]
[null,null,"% against previous yr",null,{"$f":"(E10-D10)/D10","v":-2.1251094528431214E-2},{"$f":"(F10-E10)/E10","v":1.2423148684835368E-3},2.2734306686379838E-2,1.7009303116245465E-2,1.0134288849862227E-2,6.8331804300339003E-3,1.0932118291239166E-2,8.5435515406896978E-3,6.3064939644696628E-3,7.6279000256381244E-3,null,"Product 1",{"$f":"((LCC!$E$21*(LCC!$E$20/100))*LCC!$E$22)","v":1575},{"$f":"((LCC!$E$21*(LCC!$E$20/100))*(LCC!$E$22*(1+$E$9)))","v":1480.2262042724317},{"$f":"((LCC!$E$21*(LCC!$E$20/100))*(LCC!$E$22*(1+$F$9)))","v":1427.9538904309265},{"$f":"((LCC!$E$21*(LCC!$E$20/100))*(LCC!$E$22*(1+$G$9)))","v":1405.1134254618155},{"$f":"((LCC!$E$21*(LCC!$E$20/100))*(LCC!$E$22*(1+$H$9)))","v":1401.6511689424358},{"$f":"((LCC!$E$21*(LCC!$E$20/100))*(LCC!$E$22*(1+$I$9)))","v":1408.9413148734691},{"$f":"((LCC!$E$21*(LCC!$E$20/100))*(LCC!$E$22*(1+$J$9)))","v":1430.9798264481622},{"$f":"((LCC!$E$21*(LCC!$E$20/100))*(LCC!$E$22*(1+$K$9)))","v":1453.3463263175233},{"$f":"((LCC!$E$21*(LCC!$E$20/100))*(LCC!$E$22*(1+$L$9)))","v":1477.9537536290536},{"$f":"((LCC!$E$21*(LCC!$E$20/100))*(LCC!$E$22*(1+$M$9)))","v":1503.2733318029009},{"$f":"((LCC!$E$21*(LCC!$E$20/100))*(LCC!$E$22*(1+$N$9)))","v":1523.3459377939548},{"$f":"SUM(Q11:INDEX(Q11:AA11,LCC!$E$6))","v":14564.439242178718}]
[null,null,"% cumulative",null,{"$f":"E11","v":-2.1251094528431214E-2},{"$f":"F11+E12","v":-2.0008779659947677E-2},{"$f":"G11+F12","v":2.7255270264321604E-3},1.9734830142677625E-2,2.9869118992539852E-2,3.6702299422573754E-2,4.7634417713812924E-2,5.6177969254502622E-2,6.2484463218972282E-2,7.0112363244610412E-2,null,"Product 2",{"$f":"((LCC!$G$21*(LCC!$G$20/100))*LCC!$G$22)","v":48.75},{"$f":"((LCC!$G$21*(LCC!$G$20/100))*(LCC!$G$22*(1+$E$9)))","v":45.816525370337182},{"$f":"((LCC!$G$21*(LCC!$G$20/100))*(LCC!$G$22*(1+$F$9)))","v":44.198572799052485},{"$f":"((LCC!$G$21*(LCC!$G$20/100))*(LCC!$G$22*(1+$G$9)))","v":43.491606026199058},{"$f":"((LCC!$G$21*(LCC!$G$20/100))*(LCC!$G$22*(1+$H$9)))","v":43.384440943456354},{"$f":"((LCC!$G$21*(LCC!$G$20/100))*(LCC!$G$22*(1+$I$9)))","v":43.610088317512137},{"$f":"((LCC!$G$21*(LCC!$G$20/100))*(LCC!$G$22*(1+$J$9)))","v":44.2922327233955},{"$f":"((LCC!$G$21*(LCC!$G$20/100))*(LCC!$G$22*(1+$K$9)))","v":44.984529147923347},{"$f":"((LCC!$G$21*(LCC!$G$20/100))*(LCC!$G$22*(1+$L$9)))","v":45.746187612327859},{"$f":"((LCC!$G$21*(LCC!$G$20/100))*(LCC!$G$22*(1+$M$9)))","v":46.529888841518364},{"$f":"((LCC!$G$21*(LCC!$G$20/100))*(LCC!$G$22*(1+$N$9)))","v":47.151183788860514},{"$f":"SUM(Q12:INDEX(Q12:AA12,LCC!$G$6))","v":450.80407178172226}]
["Ethanol","$/gallon","Forecasted price",2.5707420000000001,2.5745960000000001,2.5772849999999998,2.5795370000000002,2.5812029999999999,2.5974710000000001,2.6644839999999999,2.691967,2.7039330000000001,2.7027369999999999,2.602026,null,"Product 3",{"$f":"((LCC!$I$21*(LCC!$I$20/100))*LCC!$I$22)","v":1435.5000000000002},{"$f":"((LCC!$I$21*(LCC!$I$20/100))*(LCC!$I$22*(1+$E$9)))","v":1349.1204547511595},{"$f":"((LCC!$I$21*(LCC!$I$20/100))*(LCC!$I$22*(1+$F$9)))","v":1301.4779744213301},{"$f":"((LCC!$I$21*(LCC!$I$20/100))*(LCC!$I$22*(1+$G$9)))","v":1280.6605220637693},{"$f":"((LCC!$I$21*(LCC!$I$20/100))*(LCC!$I$22*(1+$H$9)))","v":1277.5049225503917},{"$f":"((LCC!$I$21*(LCC!$I$20/100))*(LCC!$I$22*(1+$I$9)))","v":1284.149369841819},{"$f":"((LCC!$I$21*(LCC!$I$20/100))*(LCC!$I$22*(1+$J$9)))","v":1304.2358989627537},{"$f":"((LCC!$I$21*(LCC!$I$20/100))*(LCC!$I$22*(1+$K$9)))","v":1324.621365986543},{"$f":"((LCC!$I$21*(LCC!$I$20/100))*(LCC!$I$22*(1+$L$9)))","v":1347.0492783076234},{"$f":"((LCC!$I$21*(LCC!$I$20/100))*(LCC!$I$22*(1+$M$9)))","v":1370.1262652717869},{"$f":"((LCC!$I$21*(LCC!$I$20/100))*(LCC!$I$22*(1+$N$9)))","v":1388.4210118750616},{"$f":"SUM(Q13:INDEX(Q13:AA13,LCC!$I$6))","v":13274.446052157176}]
[null,null,"% against previous yr",null,{"$f":"(E13-D13)/D13","v":1.4991780583193583E-3},{"$f":"(F13-E13)/E13","v":1.0444357095248029E-3},8.7378772623142764E-4,6.4585233706658334E-4,6.3024876385159058E-3,2.5799325574760897E-2,1.0314567473477096E-2,4.4450767784301008E-3,-4.4231865212643838E-4,-3.7262597137642323E-2,null,"Product 4",{"$f":"((LCC!$K$21*(LCC!$K$20/100))*LCC!$K$22)","v":1700},{"$f":"((LCC!$K$21*(LCC!$K$20/100))*(LCC!$K$22*(1+$E$9)))","v":1597.7044744527836},{"$f":"((LCC!$K$21*(LCC!$K$20/100))*(LCC!$K$22*(1+$F$9)))","v":1541.2835642746506},{"$f":"((LCC!$K$21*(LCC!$K$20/100))*(LCC!$K$22*(1+$G$9)))","v":1516.6303639905311},{"$f":"((LCC!$K$21*(LCC!$K$20/100))*(LCC!$K$22*(1+$H$9)))","v":1512.8933252077086},{"$f":"((LCC!$K$21*(LCC!$K$20/100))*(LCC!$K$22*(1+$I$9)))","v":1520.762054149141},{"$f":"((LCC!$K$21*(LCC!$K$20/100))*(LCC!$K$22*(1+$J$9)))","v":1544.5496539440483},{"$f":"((LCC!$K$21*(LCC!$K$20/100))*(LCC!$K$22*(1+$K$9)))","v":1568.6912728506604},{"$f":"((LCC!$K$21*(LCC!$K$20/100))*(LCC!$K$22*(1+$L$9)))","v":1595.2516705837404},{"$f":"((LCC!$K$21*(LCC!$K$20/100))*(LCC!$K$22*(1+$M$9)))","v":1622.5807390888453},{"$f":"((LCC!$K$21*(LCC!$K$20/100))*(LCC!$K$22*(1+$N$9)))","v":1644.2464090474432},{"$f":"SUM(Q14:INDEX(Q14:AA14,LCC!$K$6))","v":15720.347118542109}]
[null,null,"% cumulative",null,{"$f":"E14","v":1.4991780583193583E-3},{"$f":"F14+E15","v":2.5436137678441612E-3},{"$f":"G14+F15","v":3.4174014940755891E-3},4.0632538311421726E-3,1.0365741469658078E-2,3.6165067044418978E-2,4.6479634517896072E-2,5.0924711296326169E-2,5.0482392644199729E-2,1.3219795506557407E-2,null,"Product 5",{"$f":"((LCC!$M$21*(LCC!$M$20/100))*LCC!$M$22)","v":330},{"$f":"((LCC!$M$21*(LCC!$M$20/100))*(LCC!$M$22*(1+$E$9)))","v":310.14263327612855},{"$f":"((LCC!$M$21*(LCC!$M$20/100))*(LCC!$M$22*(1+$F$9)))","v":299.19033894743217},{"$f":"((LCC!$M$21*(LCC!$M$20/100))*(LCC!$M$22*(1+$G$9)))","v":294.404717715809},{"$f":"((LCC!$M$21*(LCC!$M$20/100))*(LCC!$M$22*(1+$H$9)))","v":293.67929254031986},{"$f":"((LCC!$M$21*(LCC!$M$20/100))*(LCC!$M$22*(1+$I$9)))","v":295.20675168777444},{"$f":"((LCC!$M$21*(LCC!$M$20/100))*(LCC!$M$22*(1+$J$9)))","v":299.82434458913878},{"$f":"((LCC!$M$21*(LCC!$M$20/100))*(LCC!$M$22*(1+$K$9)))","v":304.51065884748112},{"$f":"((LCC!$M$21*(LCC!$M$20/100))*(LCC!$M$22*(1+$L$9)))","v":309.66650076037314},{"$f":"((LCC!$M$21*(LCC!$M$20/100))*(LCC!$M$22*(1+$M$9)))","v":314.97155523489351},{"$f":"((LCC!$M$21*(LCC!$M$20/100))*(LCC!$M$22*(1+$N$9)))","v":319.17724410920954},{"$f":"SUM(Q15:INDEX(Q15:AA15,LCC!$M$6))","v":3051.5967935993508}]
{"$rows_left_out":43}
{"sheet":"Calculations","index":4,"n_rows":35,"n_cols":11,"rows_kept":35,"cut":false,"hidden":true,"merged":[]}
["FOR CALCULATIONS ONLY - DO NOT AMEND!"]
[]
[null,null,null,"Product 1","Product 2","Product 3","Product 4","Product 5"]
[null,null,"Type of Fuel",{"$f":"MATCH(LCC!E19,$B$20:$B$30,0)","v":1},{"$f":"MATCH(LCC!G19,$B$20:$B$30,0)","v":4},{"$f":"MATCH(LCC!I19,$B$20:$B$30,0)","v":6},{"$f":"MATCH(LCC!K19,$B$20:$B$30,0)","v":{"$error":"#N/A"}},{"$f":"MATCH(LCC!M19,$B$20:$B$30,0)","v":{"$error":"#N/A"}}]
[null,null,"Reference Fuel (1 = diesel, 2 = petrol)",1]
[null,null,"Fuel payment per period",{"$f":"(INDEX(G20:G30,D4))/LCC!E6","v":1559.697680223006},{"$f":"(INDEX(H20:H30,E4))/LCC!G6","v":48.39680797134254},{"$f":"(INDEX(I20:I30,F4))/LCC!I6","v":1466.2295692897587},{"$f":"(INDEX(J20:J30,G4))/LCC!K6","v":{"$error":"#N/A"}},{"$f":"(INDEX(K20:K30,H4))/LCC!M6","v":{"$error":"#N/A"}}]
[null,null,"Average annual battery price",{"$f":"'Fuel Prices'!AB53/LCC!E6","v":0},{"$f":"'Fuel Prices'!AB54/LCC!E6","v":300},{"$f":"'Fuel Prices'!AB55/LCC!E6","v":0},{"$f":"'Fuel Prices'!AB56/LCC!E6","v":0},{"$f":"'Fuel Prices'!AB57/LCC!E6","v":0}]
[null,null,"Fuel price per litre using own values",{"$f":"IF(INDEX(LCC!$C$77:$D$87,Calculations!D4,2)>0,LCC!E22-CUMIPMT(INDEX(LCC!$C$77:$D$87,Calculations!D4,2),LCC!$E$6,LCC!E22,1,LCC!$E$6,1),LCC!E22*(1+(INDEX(LCC!$C$77:$D$87,Calculations!E4,2))^LCC!$E$6))","v":1.528011166778853},{"$f":"IF(INDEX(LCC!$C$77:$D$87,Calculations!E4,2)>0,LCC!G22-CUMIPMT(INDEX(LCC!$C$77:$D$87,Calculations!E4,2),LCC!$E$6,LCC!G22,1,LCC!$E$6,1),LCC!G22*(1+(INDEX(LCC!$C$77:$D$87,Calculations!E4,2))^LCC!$E$6))","v":0.1358977222935869},{"$f":"IF(INDEX(LCC!$C$77:$D$87,Calculations!F4,2)>0,LCC!I22-CUMIPMT(INDEX(LCC!$C$77:$D$87,Calculations!F4,2),LCC!$E$6,LCC!I22,1,LCC!$E$6,1),LCC!I22*(1+(INDEX(LCC!$C$77:$D$87,Calculations!F4,2))^LCC!$E$6))","v":1.3567145948762132},{"$f":"IF(INDEX(LCC!$C$77:$D$87,Calculations!G4,2)>0,LCC!K22-CUMIPMT(INDEX(LCC!$C$77:$D$87,Calculations!G4,2),LCC!$E$6,LCC!K22,1,LCC!$E$6,1),LCC!K22*(1+(INDEX(LCC!$C$77:$D$87,Calculations!G4,2))^LCC!$E$6))","v":{"$error":"#N/A"}},{"$f":"IF(INDEX(LCC!$C$77:$D$87,Calculations!H4,2)>0,LCC!M22-CUMIPMT(INDEX(LCC!$C$77:$D$87,Calculations!H4,2),LCC!$E$6,LCC!M22,1,LCC!$E$6,1),LCC!M22*(1+(INDEX(LCC!$C$77:$D$87,Calculations!H4,2))^LCC!$E$6))","v":{"$error":"#N/A"}}]
[null,null,"Fuel consumption per vehicle",{"$f":"LCC!E$20","v":7.5},{"$f":"LCC!G$20","v":2.5},{"$f":"LCC!I$20","v":8.6999999999999993},{"$f":"LCC!K$20","v":10},{"$f":"LCC!M$20","v":11}]
[null,null,"Energy Content",{"$f":"INDEX($C$20:$C$30,D$4)","v":36},{"$f":"INDEX($C$20:$C$30,E$4)","v":3.6},{"$f":"INDEX($C$20:$C$30,F$4)","v":24},{"$f":"INDEX($C$20:$C$30,G$4)","v":{"$error":"#N/A"}},{"$f":"INDEX($C$20:$C$30,H$4)","v":{"$error":"#N/A"}}]
[null,null,"Energy Consumption (MJ/km)",{"$f":"(D9/100)*D10","v":2.6999999999999997},{"$f":"(E9/100)*E10","v":9.0000000000000011E-2},{"$f":"(F9/100)*F10","v":2.0880000000000001},{"$f":"(G9/100)*G10","v":{"$error":"#N/A"}},{"$f":"(H9/100)*H10","v":{"$error":"#N/A"}}]
[null,null,"Cost for reference fuel per litre (€/l)",{"$f":"LCC!E$53","v":0.8},{"$f":"LCC!G$53","v":0.8},{"$f":"LCC!I$53","v":0.8},{"$f":"LCC!K$53","v":1.2},{"$f":"LCC!M$53","v":1.2}]
[null,null,"Energy content of reference fuel",{"$f":"IF($D$5=1,$C$20, IF($D$5=2,$C$21, \"INCORRECT\"))","v":36},{"$f":"IF($D$5=1,$C$20, IF($D$5=2,$C$21, \"INCORRECT\"))","v":36},{"$f":"IF($D$5=1,$C$20, IF($D$5=2,$C$21, \"INCORRECT\"))","v":36},{"$f":"IF($D$5=1,$C$20, IF($D$5=2,$C$21, \"INCORRECT\"))","v":36},{"$f":"IF($D$5=1,$C$20, IF($D$5=2,$C$21, \"INCORRECT\"))","v":36}]
[null,null,"Cost per unit of energy (€/MJ)",{"$f":"D12/D13","v":2.2222222222222223E-2},{"$f":"E12/E13","v":2.2222222222222223E-2},{"$f":"F12/F13","v":2.2222222222222223E-2},{"$f":"G12/G13","v":3.3333333333333333E-2},{"$f":"H12/H13","v":3.3333333333333333E-2}]
[null,null,"Lifetime mileage (km)",{"$f":"LCC!E21*LCC!E$6","v":150000},{"$f":"LCC!G21*LCC!$E$6","v":150000},{"$f":"LCC!I21*LCC!$E$6","v":150000},{"$f":"LCC!K21*LCC!$E$6","v":200000},{"$f":"LCC!M21*LCC!$E$6","v":200000}]
{"$rows_left_out":21}
{"sheet":"Bugs","index":5,"n_rows":2,"n_cols":2,"rows_kept":2,"cut":false,"hidden":true,"merged":[]}
[]
[null,"Please list any bugs you find below"]