{"text_format":"1","workbook":"xlsx","n_sheets":5,"sheets":["Warning","LCC","Diagrame","Preturi combustibili","Calculari"],"not_rendered":{"charts":2,"images":3,"macros":1,"external_links":0,"defined_names":11,"comments":1,"pivot_tables":0},"unopened":[],"bounds":{"document_bytes":16777216,"sheet_cells":100000,"rows_first":2000,"rows_last":500,"rows_between":2000,"halvings":0,"cell_chars":16384,"cell_head_chars":4096},"cells_cut":0,"cells_raw":0,"read":"whole","date_system":"1900"}

{"sheet":"Warning","index":0,"n_rows":33,"n_cols":8,"rows_kept":33,"cut":false,"hidden":false,"merged":[[32,6,33,12],[16,3,16,15],[19,5,27,13],[29,3,29,15]]}
[]
[]
[]
[]
[]
[]
[]
[]
[]
[]
{"$rows_left_out":24}
{"sheet":"LCC","index":1,"n_rows":107,"n_cols":23,"rows_kept":107,"cut":false,"hidden":true,"merged":[[66,2,66,3],[67,2,67,3],[65,15,65,16]]}
[]
[null,null,null,"VEHICULE - CALCULATOR COSTURI PE DURATA DE VIATA (LCC)"]
[null,null,null,"Va rugam sa completati doar in casetele albe"]
[]
[null,"CONDITII GENERALE"]
[null,"i","Durata Contract/perioada de proprietate asupra vehiculului","An",null,null,{"$f":"E6","v":0},null,{"$f":"E6","v":0},null,{"$f":"E6","v":0},null,null,{"$f":"F6","v":0},{"$f":"M6","v":0},null,{"$f":"M6","v":0},null,{"$f":"M6","v":0},null,{"$f":"M6","v":0},null,{"$f":"O6","v":0}]
[null,"i","Procent reducere ","%",null,null,{"$f":"E7","v":0},null,{"$f":"E7","v":0},null,{"$f":"E7","v":0},null,null,{"$f":"F7","v":0},{"$f":"M7","v":0},null,{"$f":"M7","v":0},null,{"$f":"M7","v":0},null,{"$f":"M7","v":0},null,{"$f":"O7","v":0}]
[null,"i","Numar ofertanti/oferte",null,3]
[]
[null,"COSTURI DE ACHIZITIE"]
{"$rows_left_out":98}
{"sheet":"Diagrame","index":2,"n_rows":27,"n_cols":31,"rows_kept":27,"cut":false,"hidden":true,"merged":[[2,1,2,25],[26,3,26,5],[27,3,27,6]]}
[]
[]
[null,"DIAGRAMA REZULTATE LCC"]
[]
[]
[]
[]
[]
[]
[null,null,null,null,null,null,null,null,null,null,null,null,null,null,null,null,null,null,null,null,null,null,null,null,null,null,null,null,null,null,"Costuri operationale pe durata de viata"]
{"$rows_left_out":18}
{"sheet":"Preturi combustibili","index":3,"n_rows":97,"n_cols":51,"rows_kept":97,"cut":false,"hidden":true,"merged":[[39,1,40,1],[27,1,28,1],[29,1,30,1],[31,1,32,1],[33,1,34,1],[35,1,36,1],[37,1,38,1]]}
["Surse: ","OECD-FAO Perspectiva agricola\n\nSUA Administratia energie",null,null,null,null,null,null,null,null,null,null,null,null,null,null,null,null,null,null,null,null,null,"PRIMELE SERII UN SINGUR COMBUSTIBIL",null,null,null,null,null,null,null,null,null,null,null,null,"Combustibil 1\nSerii","SERII AL DOILEA COMBUSTIBIL",null,null,null,null,null,null,null,null,null,null,null,null,"Combustibil 2\nSerii"]
[null,null,0.81200000000000006,null,null,null,null,null,"5 ANI",null,null,null,null,"10 ANI"]
[null,null,{"$f":"100-C2","v":99.188000000000002},2014,2015,2016,2017,2018,2019,2020,2021,2022,2023,2024,null,null,null,null,null,null,null,null,null,"MOTORINA",2014,2015,2016,2017,2018,2019,2020,2021,2022,2023,2024,"Pret total combustibil pentru perioada vizata",null,"MOTORINA",2014,2015,2016,2017,2018,2019,2020,2021,2022,2023,2024,"Pret total combustibil pentru perioada vizata"]
["Motorina","$/gallon","Pret estimat",3.6833300000000002,3.5441319999999998,3.4952230000000002,3.4971399999999999,3.533868,3.6106159999999998,3.671875,3.7407020000000002,3.815766,3.868004,3.9180830000000002,null,null,null,null,null,null,null,null,null,"Produsul 1",{"$f":"((LCC!$E$19*(LCC!$E$21/100))*LCC!$E$22)","v":0},{"$f":"((LCC!$E$19*(LCC!$E$21/100))*(LCC!$E$22*(1+$E$6)))","v":0},{"$f":"((LCC!$E$19*(LCC!$E$21/100))*(LCC!$E$22*(1+$F$6)))","v":0},{"$f":"((LCC!$E$19*(LCC!$E$21/100))*(LCC!$E$22*(1+$G$6)))","v":0},{"$f":"((LCC!$E$19*(LCC!$E$21/100))*(LCC!$E$22*(1+$H$6)))","v":0},{"$f":"((LCC!$E$19*(LCC!$E$21/100))*(LCC!$E$22*(1+$I$6)))","v":0},{"$f":"((LCC!$E$19*(LCC!$E$21/100))*(LCC!$E$22*(1+$J$6)))","v":0},{"$f":"((LCC!$E$19*(LCC!$E$21/100))*(LCC!$E$22*(1+$K$6)))","v":0},{"$f":"((LCC!$E$19*(LCC!$E$21/100))*(LCC!$E$22*(1+$L$6)))","v":0},{"$f":"((LCC!$E$19*(LCC!$E$21/100))*(LCC!$E$22*(1+$M$6)))","v":0},{"$f":"((LCC!$E$19*(LCC!$E$21/100))*(LCC!$E$22*(1+$N$6)))","v":0},0,null,"Produsul 1",{"$f":"((LCC!$E$19*(LCC!$E$25/100))*LCC!$E$26)","v":0},{"$f":"((LCC!$E$19*(LCC!$E$25/100))*(LCC!$E$26*(1+$E$6)))","v":0},{"$f":"((LCC!$E$19*(LCC!$E$25/100))*(LCC!$E$26*(1+$F$6)))","v":0},{"$f":"((LCC!$E$19*(LCC!$E$25/100))*(LCC!$E$26*(1+$G$6)))","v":0},{"$f":"((LCC!$E$19*(LCC!$E$25/100))*(LCC!$E$26*(1+$H$6)))","v":0},{"$f":"((LCC!$E$19*(LCC!$E$25/100))*(LCC!$E$26*(1+$I$6)))","v":0},{"$f":"((LCC!$E$19*(LCC!$E$25/100))*(LCC!$E$26*(1+$J$6)))","v":0},{"$f":"((LCC!$E$19*(LCC!$E$25/100))*(LCC!$E$26*(1+$K$6)))","v":0},{"$f":"((LCC!$E$19*(LCC!$E$25/100))*(LCC!$E$26*(1+$L$6)))","v":0},{"$f":"((LCC!$E$19*(LCC!$E$25/100))*(LCC!$E$26*(1+$M$6)))","v":0},{"$f":"((LCC!$E$19*(LCC!$E$25/100))*(LCC!$E$26*(1+$N$6)))","v":0},0]
[null,null,"% fata de anul anterior",null,{"$f":"(E4-D4)/D4","v":-3.779134641750817E-2},{"$f":"(F4-E4)/E4","v":-1.3799993905418773E-2},5.4846285916513031E-4,1.0502296162006696E-2,2.1717845714667276E-2,1.6966356987284215E-2,1.8744374468085159E-2,2.0066821682133404E-2,1.3690042838056634E-2,1.2946987645307556E-2,null,null,null,null,null,null,null,null,null,"Produsul 2",{"$f":"((LCC!$G$19*(LCC!$G$21/100))*LCC!$G$22)","v":0},{"$f":"((LCC!$G$19*(LCC!$G$21/100))*(LCC!$G$22*(1+$E$6)))","v":0},{"$f":"((LCC!$G$19*(LCC!$G$21/100))*(LCC!$G$22*(1+$F$6)))","v":0},{"$f":"((LCC!$G$19*(LCC!$G$21/100))*(LCC!$G$22*(1+G$6)))","v":0},{"$f":"((LCC!$G$19*(LCC!$G$21/100))*(LCC!$G$22*(1+H$6)))","v":0},{"$f":"((LCC!$G$19*(LCC!$G$21/100))*(LCC!$G$22*(1+I$6)))","v":0},{"$f":"((LCC!$G$19*(LCC!$G$21/100))*(LCC!$G$22*(1+J$6)))","v":0},{"$f":"((LCC!$G$19*(LCC!$G$21/100))*(LCC!$G$22*(1+K$6)))","v":0},{"$f":"((LCC!$G$19*(LCC!$G$21/100))*(LCC!$G$22*(1+L$6)))","v":0},{"$f":"((LCC!$G$19*(LCC!$G$21/100))*(LCC!$G$22*(1+M$6)))","v":0},{"$f":"((LCC!$G$19*(LCC!$G$21/100))*(LCC!$G$22*(1+N$6)))","v":0},0,null,"Produsul 2",{"$f":"((LCC!$G$19*(LCC!$G$25/100))*LCC!$G$26)","v":0},{"$f":"((LCC!$G$19*(LCC!$G$25/100))*(LCC!$G$26*(1+$E$6)))","v":0},{"$f":"((LCC!$G$19*(LCC!$G$25/100))*(LCC!$G$26*(1+$F$6)))","v":0},{"$f":"((LCC!$G$19*(LCC!$G$25/100))*(LCC!$G$26*(1+$G$6)))","v":0},{"$f":"((LCC!$G$19*(LCC!$G$25/100))*(LCC!$G$26*(1+$H$6)))","v":0},{"$f":"((LCC!$G$19*(LCC!$G$25/100))*(LCC!$G$26*(1+$I$6)))","v":0},{"$f":"((LCC!$G$19*(LCC!$G$25/100))*(LCC!$G$26*(1+$J$6)))","v":0},{"$f":"((LCC!$G$19*(LCC!$G$25/100))*(LCC!$G$26*(1+$K$6)))","v":0},{"$f":"((LCC!$G$19*(LCC!$G$25/100))*(LCC!$G$26*(1+$L$6)))","v":0},{"$f":"((LCC!$G$19*(LCC!$G$25/100))*(LCC!$G$26*(1+$M$6)))","v":0},{"$f":"((LCC!$G$19*(LCC!$G$25/100))*(LCC!$G$26*(1+$N$6)))","v":0},0]
[null,null,"% cumulativ",null,{"$f":"E5","v":-3.779134641750817E-2},{"$f":"F5+E6","v":-5.1591340322926942E-2},{"$f":"G5+F6","v":-5.1042877463761814E-2},-4.054058130175512E-2,-1.8822735587087844E-2,-1.8563785998036292E-3,1.6887995868281529E-2,3.6954817550414937E-2,5.0644860388471574E-2,6.3591848033779125E-2,null,null,null,null,null,null,null,null,null,"Produsul 3",{"$f":"((LCC!$I$19*(LCC!$I$21/100))*LCC!$I$22)","v":0},{"$f":"((LCC!$I$19*(LCC!$I$21/100))*(LCC!$I$22*(1+$E$6)))","v":0},{"$f":"((LCC!$I$19*(LCC!$I$21/100))*(LCC!$I$22*(1+$F$6)))","v":0},{"$f":"((LCC!$I$19*(LCC!$I$21/100))*(LCC!$I$22*(1+G$6)))","v":0},{"$f":"((LCC!$I$19*(LCC!$I$21/100))*(LCC!$I$22*(1+H$6)))","v":0},{"$f":"((LCC!$I$19*(LCC!$I$21/100))*(LCC!$I$22*(1+I$6)))","v":0},{"$f":"((LCC!$I$19*(LCC!$I$21/100))*(LCC!$I$22*(1+J$6)))","v":0},{"$f":"((LCC!$I$19*(LCC!$I$21/100))*(LCC!$I$22*(1+K$6)))","v":0},{"$f":"((LCC!$I$19*(LCC!$I$21/100))*(LCC!$I$22*(1+L$6)))","v":0},{"$f":"((LCC!$I$19*(LCC!$I$21/100))*(LCC!$I$22*(1+M$6)))","v":0},{"$f":"((LCC!$I$19*(LCC!$I$21/100))*(LCC!$I$22*(1+N$6)))","v":0},0,null,"Produsul 3",{"$f":"((LCC!$I$19*(LCC!$I$25/100))*LCC!$I$26)","v":0},{"$f":"((LCC!$I$19*(LCC!$I$25/100))*(LCC!$I$26*(1+$E$6)))","v":0},{"$f":"((LCC!$I$19*(LCC!$I$25/100))*(LCC!$I$26*(1+$F$6)))","v":0},{"$f":"((LCC!$I$19*(LCC!$I$25/100))*(LCC!$I$26*(1+$G$6)))","v":0},{"$f":"((LCC!$I$19*(LCC!$I$25/100))*(LCC!$I$26*(1+$H$6)))","v":0},{"$f":"((LCC!$I$19*(LCC!$I$25/100))*(LCC!$I$26*(1+$I$6)))","v":0},{"$f":"((LCC!$I$19*(LCC!$I$25/100))*(LCC!$I$26*(1+$J$6)))","v":0},{"$f":"((LCC!$I$19*(LCC!$I$25/100))*(LCC!$I$26*(1+$K$6)))","v":0},{"$f":"((LCC!$I$19*(LCC!$I$25/100))*(LCC!$I$26*(1+$L$6)))","v":0},{"$f":"((LCC!$I$19*(LCC!$I$25/100))*(LCC!$I$26*(1+$M$6)))","v":0},{"$f":"((LCC!$I$19*(LCC!$I$25/100))*(LCC!$I$26*(1+$N$6)))","v":0},0]
["Benzina","$/gallon","Pret estimat",3.3808379999999998,3.1774,3.0719460000000001,3.0273970000000001,3.0207419999999998,3.0347240000000002,3.077188,3.1208870000000002,3.1696469999999999,3.220602,3.261647,null,null,null,null,null,null,null,null,null,"Produsul 4",{"$f":"((LCC!$K$19*(LCC!$K$21/100))*LCC!$K$22)","v":0},{"$f":"((LCC!$K$19*(LCC!$K$21/100))*(LCC!$K$22*(1+$E$6)))","v":0},{"$f":"((LCC!$K$19*(LCC!$K$21/100))*(LCC!$K$22*(1+$F$6)))","v":0},{"$f":"((LCC!$K$19*(LCC!$K$21/100))*(LCC!$K$22*(1+G$6)))","v":0},{"$f":"((LCC!$K$19*(LCC!$K$21/100))*(LCC!$K$22*(1+H$6)))","v":0},{"$f":"((LCC!$K$19*(LCC!$K$21/100))*(LCC!$K$22*(1+I$6)))","v":0},{"$f":"((LCC!$K$19*(LCC!$K$21/100))*(LCC!$K$22*(1+J$6)))","v":0},{"$f":"((LCC!$K$19*(LCC!$K$21/100))*(LCC!$K$22*(1+K$6)))","v":0},{"$f":"((LCC!$K$19*(LCC!$K$21/100))*(LCC!$K$22*(1+L$6)))","v":0},{"$f":"((LCC!$K$19*(LCC!$K$21/100))*(LCC!$K$22*(1+M$6)))","v":0},{"$f":"((LCC!$K$19*(LCC!$K$21/100))*(LCC!$K$22*(1+N$6)))","v":0},0,null,"Produsul 4",{"$f":"((LCC!$K$19*(LCC!$K$25/100))*LCC!$K$26)","v":0},{"$f":"((LCC!$K$19*(LCC!$K$25/100))*(LCC!$K$26*(1+$E$6)))","v":0},{"$f":"((LCC!$K$19*(LCC!$K$25/100))*(LCC!$K$26*(1+$F$6)))","v":0},{"$f":"((LCC!$K$19*(LCC!$K$25/100))*(LCC!$K$26*(1+$G$6)))","v":0},{"$f":"((LCC!$K$19*(LCC!$K$25/100))*(LCC!$K$26*(1+$H$6)))","v":0},{"$f":"((LCC!$K$19*(LCC!$K$25/100))*(LCC!$K$26*(1+$I$6)))","v":0},{"$f":"((LCC!$K$19*(LCC!$K$25/100))*(LCC!$K$26*(1+$J$6)))","v":0},{"$f":"((LCC!$K$19*(LCC!$K$25/100))*(LCC!$K$26*(1+$K$6)))","v":0},{"$f":"((LCC!$K$19*(LCC!$K$25/100))*(LCC!$K$26*(1+$L$6)))","v":0},{"$f":"((LCC!$K$19*(LCC!$K$25/100))*(LCC!$K$26*(1+$M$6)))","v":0},{"$f":"((LCC!$K$19*(LCC!$K$25/100))*(LCC!$K$26*(1+$N$6)))","v":0},0]
[null,null,"% fata de anul anterior",null,{"$f":"(E7-D7)/D7","v":-6.0173838557186062E-2},{"$f":"(F7-E7)/E7","v":-3.3188770693019433E-2},-1.4501882520070323E-2,-2.1982581075426512E-3,4.62866408319558E-3,1.3992705761710071E-2,1.4200952298007191E-2,1.5623763372400118E-2,1.6075922650061691E-2,1.2744511740351648E-2," ",null,null,null,null,null,null,null,null,"Produsul 5",{"$f":"((LCC!$M$19*(LCC!$M$21/100))*LCC!$M$22)","v":0},{"$f":"((LCC!$M$19*(LCC!$M$21/100))*(LCC!$M$22*(1+$E$6)))","v":0},{"$f":"((LCC!$M$19*(LCC!$M$21/100))*(LCC!$M$22*(1+$F$6)))","v":0},{"$f":"((LCC!$M$19*(LCC!$M$21/100))*(LCC!$M$22*(1+G$6)))","v":0},{"$f":"((LCC!$M$19*(LCC!$M$21/100))*(LCC!$M$22*(1+H$6)))","v":0},{"$f":"((LCC!$M$19*(LCC!$M$21/100))*(LCC!$M$22*(1+I$6)))","v":0},{"$f":"((LCC!$M$19*(LCC!$M$21/100))*(LCC!$M$22*(1+J$6)))","v":0},{"$f":"((LCC!$M$19*(LCC!$M$21/100))*(LCC!$M$22*(1+K$6)))","v":0},{"$f":"((LCC!$M$19*(LCC!$M$21/100))*(LCC!$M$22*(1+L$6)))","v":0},{"$f":"((LCC!$M$19*(LCC!$M$21/100))*(LCC!$M$22*(1+M$6)))","v":0},{"$f":"((LCC!$M$19*(LCC!$M$21/100))*(LCC!$M$22*(1+N$6)))","v":0},0,null,"Produsul 5",{"$f":"((LCC!$M$19*(LCC!$M$25/100))*LCC!$M$26)","v":0},{"$f":"((LCC!$M$19*(LCC!$M$25/100))*(LCC!$M$26*(1+$E$6)))","v":0},{"$f":"((LCC!$M$19*(LCC!$M$25/100))*(LCC!$M$26*(1+$F$6)))","v":0},{"$f":"((LCC!$M$19*(LCC!$M$25/100))*(LCC!$M$26*(1+$G$6)))","v":0},{"$f":"((LCC!$M$19*(LCC!$M$25/100))*(LCC!$M$26*(1+$H$6)))","v":0},{"$f":"((LCC!$M$19*(LCC!$M$25/100))*(LCC!$M$26*(1+$I$6)))","v":0},{"$f":"((LCC!$M$19*(LCC!$M$25/100))*(LCC!$M$26*(1+$J$6)))","v":0},{"$f":"((LCC!$M$19*(LCC!$M$25/100))*(LCC!$M$26*(1+$K$6)))","v":0},{"$f":"((LCC!$M$19*(LCC!$M$25/100))*(LCC!$M$26*(1+$L$6)))","v":0},{"$f":"((LCC!$M$19*(LCC!$M$25/100))*(LCC!$M$26*(1+$M$6)))","v":0},{"$f":"((LCC!$M$19*(LCC!$M$25/100))*(LCC!$M$26*(1+$N$6)))","v":0},0]
[null,null,"% cumulativ",null,{"$f":"E8","v":-6.0173838557186062E-2},{"$f":"F8+E9","v":-9.3362609250205494E-2},{"$f":"G8+F9","v":-0.10786449177027582},-0.11006274987781847,-0.10543408579462289,-9.1441380032912828E-2,-7.7240427734905637E-2,-6.161666436250552E-2,-4.5540741712443829E-2,-3.2796229972092181E-2,null,null,null,null,null,null,null,null,null,"Produsul 6",{"$f":"((LCC!$O$19*(LCC!$O$21/100))*LCC!$O$22)","v":0},{"$f":"((LCC!$O$19*(LCC!$O$21/100))*(LCC!$O$22*(1+$E$6)))","v":0},{"$f":"((LCC!$O$19*(LCC!$O$21/100))*(LCC!$O$22*(1+$F$6)))","v":0},{"$f":"((LCC!$O$19*(LCC!$O$21/100))*(LCC!$O$22*(1+G$6)))","v":0},{"$f":"((LCC!$O$19*(LCC!$O$21/100))*(LCC!$O$22*(1+H$6)))","v":0},{"$f":"((LCC!$O$19*(LCC!$O$21/100))*(LCC!$O$22*(1+I$6)))","v":0},{"$f":"((LCC!$O$19*(LCC!$O$21/100))*(LCC!$O$22*(1+J$6)))","v":0},{"$f":"((LCC!$O$19*(LCC!$O$21/100))*(LCC!$O$22*(1+K$6)))","v":0},{"$f":"((LCC!$O$19*(LCC!$O$21/100))*(LCC!$O$22*(1+L$6)))","v":0},{"$f":"((LCC!$O$19*(LCC!$O$21/100))*(LCC!$O$22*(1+M$6)))","v":0},{"$f":"((LCC!$O$19*(LCC!$O$21/100))*(LCC!$O$22*(1+N$6)))","v":0},0,null,"Produsul 6",{"$f":"((LCC!$O$19*(LCC!$O$25/100))*LCC!$O$26)","v":0},{"$f":"((LCC!$O$19*(LCC!$O$25/100))*(LCC!$O$26*(1+$E$6)))","v":0},{"$f":"((LCC!$O$19*(LCC!$O$25/100))*(LCC!$O$26*(1+$F$6)))","v":0},{"$f":"((LCC!$O$19*(LCC!$O$25/100))*(LCC!$O$26*(1+$G$6)))","v":0},{"$f":"((LCC!$O$19*(LCC!$O$25/100))*(LCC!$O$26*(1+$H$6)))","v":0},{"$f":"((LCC!$O$19*(LCC!$O$25/100))*(LCC!$O$26*(1+$I$6)))","v":0},{"$f":"((LCC!$O$19*(LCC!$O$25/100))*(LCC!$O$26*(1+$J$6)))","v":0},{"$f":"((LCC!$O$19*(LCC!$O$25/100))*(LCC!$O$26*(1+$K$6)))","v":0},{"$f":"((LCC!$O$19*(LCC!$O$25/100))*(LCC!$O$26*(1+$L$6)))","v":0},{"$f":"((LCC!$O$19*(LCC!$O$25/100))*(LCC!$O$26*(1+$M$6)))","v":0},{"$f":"((LCC!$O$19*(LCC!$O$25/100))*(LCC!$O$26*(1+$N$6)))","v":0},0]
["LPG","$/gallon","Pret estimat",2.1892990000000001,2.1427740000000002,2.1454360000000001,2.1942110000000001,2.2315330000000002,2.2541479999999998,2.2695509999999999,2.294362,2.3139639999999999,2.328557,2.3463189999999998,null,null,null,null,null,null,null,null,null,"Produsul 7",{"$f":"((LCC!$Q$19*(LCC!$Q$21/100))*LCC!$Q$22)","v":0},{"$f":"((LCC!$Q$19*(LCC!$Q$21/100))*(LCC!$Q$22*(1+$E$6)))","v":0},{"$f":"((LCC!$Q$19*(LCC!$Q$21/100))*(LCC!$Q$22*(1+$F$6)))","v":0},{"$f":"((LCC!$Q$19*(LCC!$Q$21/100))*(LCC!$Q$22*(1+G$6)))","v":0},{"$f":"((LCC!$Q$19*(LCC!$Q$21/100))*(LCC!$Q$22*(1+H$6)))","v":0},{"$f":"((LCC!$Q$19*(LCC!$Q$21/100))*(LCC!$Q$22*(1+I$6)))","v":0},{"$f":"((LCC!$Q$19*(LCC!$Q$21/100))*(LCC!$Q$22*(1+J$6)))","v":0},{"$f":"((LCC!$Q$19*(LCC!$Q$21/100))*(LCC!$Q$22*(1+K$6)))","v":0},{"$f":"((LCC!$Q$19*(LCC!$Q$21/100))*(LCC!$Q$22*(1+L$6)))","v":0},{"$f":"((LCC!$Q$19*(LCC!$Q$21/100))*(LCC!$Q$22*(1+M$6)))","v":0},{"$f":"((LCC!$Q$19*(LCC!$Q$21/100))*(LCC!$Q$22*(1+N$6)))","v":0},0,null,"Produsul 7",{"$f":"((LCC!$Q$19*(LCC!$Q$25/100))*LCC!$Q$26)","v":0},{"$f":"((LCC!$Q$19*(LCC!$Q$25/100))*(LCC!$Q$26*(1+$E$6)))","v":0},{"$f":"((LCC!$Q$19*(LCC!$Q$25/100))*(LCC!$Q$26*(1+$F$6)))","v":0},{"$f":"((LCC!$Q$19*(LCC!$Q$25/100))*(LCC!$Q$26*(1+$G$6)))","v":0},{"$f":"((LCC!$Q$19*(LCC!$Q$25/100))*(LCC!$Q$26*(1+$H$6)))","v":0},{"$f":"((LCC!$Q$19*(LCC!$Q$25/100))*(LCC!$Q$26*(1+$I$6)))","v":0},{"$f":"((LCC!$Q$19*(LCC!$Q$25/100))*(LCC!$Q$26*(1+$J$6)))","v":0},{"$f":"((LCC!$Q$19*(LCC!$Q$25/100))*(LCC!$Q$26*(1+$K$6)))","v":0},{"$f":"((LCC!$Q$19*(LCC!$Q$25/100))*(LCC!$Q$26*(1+$L$6)))","v":0},{"$f":"((LCC!$Q$19*(LCC!$Q$25/100))*(LCC!$Q$26*(1+$M$6)))","v":0},{"$f":"((LCC!$Q$19*(LCC!$Q$25/100))*(LCC!$Q$26*(1+$N$6)))","v":0},0]
{"$rows_left_out":88}
{"sheet":"Calculari","index":4,"n_rows":59,"n_cols":16,"rows_kept":59,"cut":false,"hidden":true,"merged":[]}
["FOR CALCULATIONS ONLY - DO NOT AMEND!"]
[]
[null,null,null,"Produsul 1","Produsul 2","Produsul 3","Produsul 4","Produsul 5","Produsul 6","Produsul 7","Produsul 8","Produsul 9","Produsul 10"]
[null,null,"Tip combustibil",{"$f":"MATCH(LCC!E20,$B$26:$B$38,0)","v":{"$error":"#N/A"}},{"$f":"MATCH(LCC!G20,$B$26:$B$38,0)","v":{"$error":"#N/A"}},{"$f":"MATCH(LCC!I20,$B$26:$B$38,0)","v":{"$error":"#N/A"}},{"$f":"MATCH(LCC!K20,$B$26:$B$38,0)","v":{"$error":"#N/A"}},{"$f":"MATCH(LCC!M20,$B$26:$B$38,0)","v":{"$error":"#N/A"}},{"$f":"MATCH(LCC!O20,$B$26:$B$38,0)","v":{"$error":"#N/A"}},{"$f":"MATCH(LCC!Q20,$B$26:$B$38,0)","v":{"$error":"#N/A"}},{"$f":"MATCH(LCC!S20,$B$26:$B$38,0)","v":{"$error":"#N/A"}},{"$f":"MATCH(LCC!U20,$B$26:$B$38,0)","v":{"$error":"#N/A"}},{"$f":"MATCH(LCC!W20,$B$26:$B$38,0)","v":{"$error":"#N/A"}}]
[null,null,"Tip combustibil 2",{"$f":"MATCH(LCC!E24,$B$26:$B$38,0)","v":{"$error":"#N/A"}},{"$f":"MATCH(LCC!G24,$B$26:$B$38,0)","v":{"$error":"#N/A"}},{"$f":"MATCH(LCC!I24,$B$26:$B$38,0)","v":{"$error":"#N/A"}},{"$f":"MATCH(LCC!K24,$B$26:$B$38,0)","v":{"$error":"#N/A"}},{"$f":"MATCH(LCC!M24,$B$26:$B$38,0)","v":{"$error":"#N/A"}},{"$f":"MATCH(LCC!O24,$B$26:$B$38,0)","v":{"$error":"#N/A"}},{"$f":"MATCH(LCC!Q24,$B$26:$B$38,0)","v":{"$error":"#N/A"}},{"$f":"MATCH(LCC!S24,$B$26:$B$38,0)","v":{"$error":"#N/A"}},{"$f":"MATCH(LCC!U24,$B$26:$B$38,0)","v":{"$error":"#N/A"}},{"$f":"MATCH(LCC!W24,$B$26:$B$38,0)","v":{"$error":"#N/A"}}]
[null,null,"Combustibil de referinta (1 = motorina, 2 = benzina)",{"$f":"IF(LCC!E58>0,IF(LCC!E58=\"Diesel\",1,2),0)","v":0},{"$f":"IF(LCC!G58>0,IF(LCC!G58=\"Diesel\",1,2),0)","v":0},{"$f":"IF(LCC!I58>0,IF(LCC!I58=\"Diesel\",1,2),0)","v":0},{"$f":"IF(LCC!K58>0,IF(LCC!K58=\"Diesel\",1,2),0)","v":0},{"$f":"IF(LCC!M58>0,IF(LCC!M58=\"Diesel\",1,2),0)","v":0},{"$f":"IF(LCC!O58>0,IF(LCC!O58=\"Diesel\",1,2),0)","v":0},{"$f":"IF(LCC!Q58>0,IF(LCC!Q58=\"Diesel\",1,2),0)","v":0},{"$f":"IF(LCC!S58>0,IF(LCC!S58=\"Diesel\",1,2),0)","v":0},{"$f":"IF(LCC!U58>0,IF(LCC!U58=\"Diesel\",1,2),0)","v":0},{"$f":"IF(LCC!W58>0,IF(LCC!W58=\"Diesel\",1,2),0)","v":0}]
[null,null,"Combustibilul 1",{"$f":"INDEX($G$26:$G$38,D4)/LCC!$E$6","v":{"$error":"#N/A"}},{"$f":"INDEX($G$26:$G$38,E4)/LCC!$E$6","v":{"$error":"#N/A"}},{"$f":"INDEX($G$26:$G$38,F4)/LCC!$E$6","v":{"$error":"#N/A"}},{"$f":"INDEX($G$26:$G$38,G4)/LCC!$E$6","v":{"$error":"#N/A"}},{"$f":"INDEX($G$26:$G$38,H4)/LCC!$E$6","v":{"$error":"#N/A"}},{"$f":"INDEX($G$26:$G$38,I4)/LCC!$E$6","v":{"$error":"#N/A"}},{"$f":"INDEX($G$26:$G$38,J4)/LCC!$E$6","v":{"$error":"#N/A"}},{"$f":"INDEX($G$26:$G$38,K4)/LCC!$E$6","v":{"$error":"#N/A"}},{"$f":"INDEX($G$26:$G$38,L4)/LCC!$E$6","v":{"$error":"#N/A"}},{"$f":"INDEX($G$26:$G$38,M4)/LCC!$E$6","v":{"$error":"#N/A"}}]
[null,null,"Combustibilul 2",{"$f":"IF(LCC!E23=\"Yes\",INDEX($G$42:$G$54,D5)/LCC!$E$6,0)","v":0},{"$f":"IF(LCC!G23=\"Yes\",INDEX($G$42:$G$54,E5)/LCC!$E$6,0)","v":0},{"$f":"IF(LCC!I23=\"Yes\",INDEX($G$42:$G$54,F5)/LCC!$E$6,0)","v":0},{"$f":"IF(LCC!K23=\"Yes\",INDEX($G$42:$G$54,G5)/LCC!$E$6,0)","v":0},{"$f":"IF(LCC!M23=\"Yes\",INDEX($G$42:$G$54,H5)/LCC!$E$6,0)","v":0},{"$f":"IF(LCC!O23=\"Yes\",INDEX($G$42:$G$54,I5)/LCC!$E$6,0)","v":0},{"$f":"IF(LCC!Q23=\"Yes\",INDEX($G$42:$G$54,J5)/LCC!$E$6,0)","v":0},{"$f":"IF(LCC!S23=\"Yes\",INDEX($G$42:$G$54,K5)/LCC!$E$6,0)","v":0},{"$f":"IF(LCC!U23=\"Yes\",INDEX($G$42:$G$54,L5)/LCC!$E$6,0)","v":0},{"$f":"IF(LCC!W23=\"Yes\",INDEX($G$42:$G$54,M5)/LCC!$E$6,0)","v":0}]
[null,null,"Plata combustibil per perioada",{"$f":"SUM(D7:D8)","v":{"$error":"#N/A"}},{"$error":"#N/A"},{"$error":"#N/A"},{"$error":"#N/A"},{"$error":"#N/A"},{"$error":"#N/A"},{"$error":"#N/A"},{"$error":"#N/A"},{"$error":"#N/A"},{"$error":"#N/A"}]
[null,null,"Pret mediu anual baterie",{"$f":"'Preturi combustibili'!AJ53/LCC!$E$6+'Preturi combustibili'!AX53/LCC!$E$6","v":{"$error":"#DIV/0!"}},{"$f":"'Preturi combustibili'!AJ54/LCC!$E$6+'Preturi combustibili'!AJ54/LCC!$E$6","v":{"$error":"#DIV/0!"}},{"$f":"'Preturi combustibili'!AJ55/LCC!$E$6+'Preturi combustibili'!AJ55/LCC!$E$6","v":{"$error":"#DIV/0!"}},{"$f":"'Preturi combustibili'!AJ56/LCC!$E$6+'Preturi combustibili'!AJ56/LCC!$E$6","v":{"$error":"#DIV/0!"}},{"$f":"'Preturi combustibili'!AJ57/LCC!$E$6+'Preturi combustibili'!AJ57/LCC!$E$6","v":{"$error":"#DIV/0!"}},{"$f":"'Preturi combustibili'!AK57/LCC!$E$6+'Preturi combustibili'!AK57/LCC!$E$6","v":{"$error":"#DIV/0!"}},{"$f":"'Preturi combustibili'!AL57/LCC!$E$6+'Preturi combustibili'!AL57/LCC!$E$6","v":{"$error":"#VALUE!"}},{"$f":"'Preturi combustibili'!AM57/LCC!$E$6+'Preturi combustibili'!AM57/LCC!$E$6","v":{"$error":"#DIV/0!"}},{"$f":"'Preturi combustibili'!AN57/LCC!$E$6+'Preturi combustibili'!AN57/LCC!$E$6","v":{"$error":"#DIV/0!"}},{"$f":"'Preturi combustibili'!AO57/LCC!$E$6+'Preturi combustibili'!AO57/LCC!$E$6","v":{"$error":"#DIV/0!"}}]
{"$rows_left_out":49}