{"text_format":"1","workbook":"xlsx","n_sheets":7,"sheets":["Warning","LCC","Diagramma","prezzi combustibile","calcoli","esempio","calcolo esempio"],"not_rendered":{"charts":2,"images":3,"macros":1,"external_links":0,"defined_names":22,"comments":2,"pivot_tables":0},"unopened":[],"bounds":{"document_bytes":16777216,"sheet_cells":100000,"rows_first":2000,"rows_last":500,"rows_between":2000,"halvings":0,"cell_chars":16384,"cell_head_chars":4096},"cells_cut":0,"cells_raw":0,"read":"whole","date_system":"1900"}

{"sheet":"Warning","index":0,"n_rows":33,"n_cols":8,"rows_kept":33,"cut":false,"hidden":false,"merged":[[32,6,33,12],[16,3,16,15],[19,5,27,13],[29,3,29,15]]}
[]
[]
[]
[]
[]
[]
[]
[]
[]
[]
[]
[null,null,null,null,null,null,null,"Calcolatore del costo del ciclo di vita (LCC)"]
[]
[]
[]
[]
[null,null,null,"Abilitare le funzioni Macro per usare il file "]
[]
[]
[null,null,null,null,null,"Per favore clicca sul tasto \"Opzioni\" per abilitare il contenuto"]
[]
[]
[]
[]
[]
[]
[]
[]
[]
[null,null,null,"Lo strumento di calcolo Clean Fleets LCC è un facile strumento che consente di comparare il LCC/TCO di diversi veicoli e offerte di appalto.\n\nLo strumenti è conforme alla direttiva CVD  (2009/33/EC). Include anche l'opzione per utilizzare la metodologia di calcolo dei costi operativi di vita del prodotto proposta nella Direttiva. Questa metodologia monetizza gli impatti ambientali del consumo di carburanti e le emissioni di scarico del veicolo."]
[]
[]
[null,null,null,null,null,null,"I contenuti del documento sono sotto la responsabilità del solo progetto Clean Fleets e non possono essere considerati corrispondenti con il punto di vista dell'Unione Europea "]

{"sheet":"LCC","index":1,"n_rows":110,"n_cols":23,"rows_kept":110,"cut":false,"hidden":true,"merged":[[67,2,67,3],[68,2,68,3],[66,15,66,16]]}
[]
[null,null,null,"VEICOLI - CALCOLATORE LCC"]
[null,null,null,"completa riempiendo solo le celle bianche "]
[]
[null,"CONDIZIONI GENERALI"]
[null,"i","lunghezza contratto","anno"]
[null,"i","sconto","%"]
[null,"i","numero offerte",null,3]
[]
[null,"COSTI DI ACQUISIZIONE"]
[null,null,"Name del modello di veicolo",null,"prodotto 1",null,"prodotto 2",null,"prodotto 3",null,"prodotto 4",null,"prodotto 5",null,"prodotto 6",null,"prodotto 7",null,"prodotto 8",null,"prodotto 9",null,"prodotto 10"]
[]
[null,"i","numero di veicoli"]
[null,"i","prezzo di acquisto","€/unità",null,"€/unità",null,"€/unità",null,"€/unità",null,"€/unità",null,"€/unità",null,"€/unità",null,"€/unità",null,"€/unità",null,"€/unità"]
[null,null,"(or) prezzo leasing","€/unità/anno",null,"€/unità/anno",null,"€/unità/anno",null,"€/unità/anno",null,"€/unità/anno",null,"€/unità/anno",null,"€/unità/anno",null,"€/unità/anno",null,"€/unità/anno",null,"€/unità/anno"]
[null,null,"COSTI DI ACQUISIZIONE / unità",null,{"$f":"IF(CELL(\"contents\",E13)>0,-PV($E$7*0.01,$E$6,E15)+E14,0)","v":0},null,{"$f":"IF(CELL(\"contents\",G13)>0,-PV($E$7*0.01,$E$6,G15)+G14,0)","v":0},null,{"$f":"IF(CELL(\"contents\",I13)>0,-PV($E$7*0.01,$E$6,I15)+I14,0)","v":0},null,{"$f":"IF(CELL(\"contents\",K13)>0,-PV($E$7*0.01,$E$6,K15)+K14,0)","v":0},null,{"$f":"IF(CELL(\"contents\",M13)>0,-PV($E$7*0.01,$E$6,M15)+M14,0)","v":0},null,{"$f":"IF(CELL(\"contents\",O13)>0,-PV($E$7*0.01,$E$6,O15)+O14,0)","v":0},null,{"$f":"IF(CELL(\"contents\",Q13)>0,-PV($E$7*0.01,$E$6,Q15)+Q14,0)","v":0},null,{"$f":"IF(CELL(\"contents\",S13)>0,-PV($E$7*0.01,$E$6,S15)+S14,0)","v":0},null,{"$f":"IF(CELL(\"contents\",U13)>0,-PV($E$7*0.01,$E$6,U15)+U14,0)","v":0},null,{"$f":"IF(CELL(\"contents\",W13)>0,-PV($E$7*0.01,$E$6,W15)+W14,0)","v":0}]
[]
[null,"COSTI OPERATIVI PER VEICOLO"]
[null,"i","uso annuale veicolo","km",null,"km",null,"km",null,"km",null,"km",null,"km",null,"km",null,"km",null,"km",null,"km"]
[null,"i","tipo di carburante"]
[null,"i","consumo di carburante per veicolo ",{"$f":"IF(CELL(\"contents\",E20)>0,INDEX(calcoli!$E$26:$E$38,calcoli!D$4),\"\")","v":""},null,{"$f":"IF(CELL(\"contents\",G20)>0,INDEX(calcoli!$E$26:$E$38,calcoli!E$4),\"\")","v":""},null,{"$f":"IF(CELL(\"contents\",I20)>0,INDEX(calcoli!$E$26:$E$38,calcoli!F$4),\"\")","v":""},null,{"$f":"IF(CELL(\"contents\",K20)>0,INDEX(calcoli!$E$26:$E$38,calcoli!G$4),\"\")","v":""},null,{"$f":"IF(CELL(\"contents\",M20)>0,INDEX(calcoli!$E$26:$E$38,calcoli!H$4),\"\")","v":""},null,{"$f":"IF(CELL(\"contents\",O20)>0,INDEX(calcoli!$E$26:$E$38,calcoli!I$4),\"\")","v":""},null,{"$f":"IF(CELL(\"contents\",Q20)>0,INDEX(calcoli!$E$26:$E$38,calcoli!J$4),\"\")","v":""},null,{"$f":"IF(CELL(\"contents\",S20)>0,INDEX(calcoli!$E$26:$E$38,calcoli!K$4),\"\")","v":""},null,{"$f":"IF(CELL(\"contents\",U20)>0,INDEX(calcoli!$E$26:$E$38,calcoli!L$4),\"\")","v":""},null,{"$f":"IF(CELL(\"contents\",W20)>0,INDEX(calcoli!$E$26:$E$38,calcoli!M$4),\"\")","v":""}]
[null,null,"prezzo carburante",{"$f":"IF(CELL(\"contents\",E20)>0,INDEX(calcoli!$F$26:$F$38,calcoli!D4),\"\")","v":""},null,{"$f":"IF(CELL(\"contents\",G20)>0,INDEX(calcoli!$F$26:$F$38,calcoli!E4),\"\")","v":""},null,{"$f":"IF(CELL(\"contents\",I20)>0,INDEX(calcoli!$F$26:$F$38,calcoli!F4),\"\")","v":""},null,{"$f":"IF(CELL(\"contents\",K20)>0,INDEX(calcoli!$F$26:$F$38,calcoli!G$4),\"\")","v":""},null,{"$f":"IF(CELL(\"contents\",M20)>0,INDEX(calcoli!$F$26:$F$38,calcoli!H$4),\"\")","v":""},null,{"$f":"IF(CELL(\"contents\",O20)>0,INDEX(calcoli!$F$26:$F$38,calcoli!I4),\"\")","v":""},null,{"$f":"IF(CELL(\"contents\",Q20)>0,INDEX(calcoli!$F$26:$F$38,calcoli!J4),\"\")","v":""},null,{"$f":"IF(CELL(\"contents\",S20)>0,INDEX(calcoli!$F$26:$F$38,calcoli!K4),\"\")","v":""},null,{"$f":"IF(CELL(\"contents\",U20)>0,INDEX(calcoli!$F$26:$F$38,calcoli!L4),\"\")","v":""},null,{"$f":"IF(CELL(\"contents\",W20)>0,INDEX(calcoli!$F$26:$F$38,calcoli!M4),\"\")","v":""}]
[null,"i","secondo tipo di carburante?"]
[null,null,"tipo di carburante"]
[null,"i","consumo di carburante per veicolo ",{"$f":"IF(CELL(\"contents\",E24)>0,INDEX(calcoli!$E$26:$E$38,calcoli!D$5),\"\")","v":""},null,{"$f":"IF(CELL(\"contents\",G24)>0,INDEX(calcoli!$E$26:$E$38,calcoli!E$5),\"\")","v":""},null,{"$f":"IF(CELL(\"contents\",I24)>0,INDEX(calcoli!$E$26:$E$38,calcoli!F$5),\"\")","v":""},null,{"$f":"IF(CELL(\"contents\",K24)>0,INDEX(calcoli!$E$26:$E$38,calcoli!G$5),\"\")","v":""},null,{"$f":"IF(CELL(\"contents\",M24)>0,INDEX(calcoli!$E$26:$E$38,calcoli!H$5),\"\")","v":""},null,{"$f":"IF(CELL(\"contents\",O24)>0,INDEX(calcoli!$E$26:$E$38,calcoli!I$5),\"\")","v":""},null,{"$f":"IF(CELL(\"contents\",Q24)>0,INDEX(calcoli!$E$26:$E$38,calcoli!J$5),\"\")","v":""},null,{"$f":"IF(CELL(\"contents\",S24)>0,INDEX(calcoli!$E$26:$E$38,calcoli!K$5),\"\")","v":""},null,{"$f":"IF(CELL(\"contents\",U24)>0,INDEX(calcoli!$E$26:$E$38,calcoli!L$5),\"\")","v":""},null,{"$f":"IF(CELL(\"contents\",W24)>0,INDEX(calcoli!$E$26:$E$38,calcoli!M$5),\"\")","v":""}]
[null,null,"prezzo carburante",{"$f":"IF(CELL(\"contents\",E24)>0,INDEX(calcoli!$F$26:$F$38,calcoli!D5),\"\")","v":""},null,{"$f":"IF(CELL(\"contents\",G24)>0,INDEX(calcoli!$F$26:$F$38,calcoli!E5),\"\")","v":""},null,{"$f":"IF(CELL(\"contents\",I24)>0,INDEX(calcoli!$F$26:$F$38,calcoli!F5),\"\")","v":""},null,{"$f":"IF(CELL(\"contents\",K24)>0,INDEX(calcoli!$F$26:$F$38,calcoli!G5),\"\")","v":""},null,{"$f":"IF(CELL(\"contents\",M24)>0,INDEX(calcoli!$F$26:$F$38,calcoli!H5),\"\")","v":""},null,{"$f":"IF(CELL(\"contents\",O24)>0,INDEX(calcoli!$F$26:$F$38,calcoli!I5),\"\")","v":""},null,{"$f":"IF(CELL(\"contents\",Q24)>0,INDEX(calcoli!$F$26:$F$38,calcoli!J5),\"\")","v":""},null,{"$f":"IF(CELL(\"contents\",S24)>0,INDEX(calcoli!$F$26:$F$38,calcoli!K5),\"\")","v":""},null,{"$f":"IF(CELL(\"contents\",U24)>0,INDEX(calcoli!$F$26:$F$38,calcoli!L5),\"\")","v":""},null,{"$f":"IF(CELL(\"contents\",W24)>0,INDEX(calcoli!$F$26:$F$38,calcoli!M5),\"\")","v":""}]
[null,null,"sostituzione batteria","€/unità",null,"€/unità",null,"€/unità",null,"€/unità",null,"€/unità",null,"€/unità",null,"€/unità",null,"€/unità",null,"€/unità",null,"€/unità"]
[null,null,"tempo di vita atteso per la batteria","anni",null,"anni",null,"anni",null,"anni",null,"anni",null,"anni",null,"anni",null,"anni",null,"anni",null,"anni"]
[null,null,"(o) prezzo di leasing della batteria ","€/unità/anno",null,"€/unità/anno",null,"€/unità/anno",null,"€/unità/anno",null,"€/unità/anno",null,"€/unità/anno",null,"€/unità/anno",null,"€/unità/anno",null,"€/unità/anno",null,"€/unità/anno"]
[null,null,"COSTI OPERATIVI / unità ",null,{"$f":"IF(CELL(\"contents\",E19)>0,IF($C$81=\"Use default OECD-FAO values\",-PV($E$7*0.01,$E$6,calcoli!D9+calcoli!D10+LCC!E29),-PV($E$7*0.01,$E$6,(E21*(E19/100)*calcoli!D11)+(E$25*(E19/100)*calcoli!D12))+calcoli!D10+LCC!E29),0)","v":0},null,{"$f":"IF(CELL(\"contents\",G19)>0,IF($C$81=\"Use default OECD-FAO values\",-PV($E$7*0.01,$E$6,calcoli!E9+calcoli!E10+LCC!G29),-PV($E$7*0.01,$E$6,(G21*(G19/100)*calcoli!E11)+(G$25*(G19/100)*calcoli!E12))+calcoli!E10+LCC!G29),0)","v":0},null,{"$f":"IF(CELL(\"contents\",I19)>0,IF($C$81=\"Use default OECD-FAO values\",-PV($E$7*0.01,$E$6,calcoli!F9+calcoli!F10+LCC!I29),-PV($E$7*0.01,$E$6,(I21*(I19/100)*calcoli!F11)+(I$25*(I19/100)*calcoli!F12))+calcoli!F10+LCC!I29),0)","v":0},null,{"$f":"IF(CELL(\"contents\",K19)>0,IF($C$81=\"Use default OECD-FAO values\",-PV($E$7*0.01,$E$6,calcoli!G9+calcoli!G10+LCC!K29),-PV($E$7*0.01,$E$6,(K21*(K19/100)*calcoli!G11)+(K$25*(K19/100)*calcoli!G12))+calcoli!G10+LCC!K29),0)","v":0},null,{"$f":"IF(CELL(\"contents\",M19)>0,IF($C$81=\"Use default OECD-FAO values\",-PV($E$7*0.01,$E$6,calcoli!H9+calcoli!H10+LCC!M29),-PV($E$7*0.01,$E$6,(M21*(M19/100)*calcoli!H11)+(M$25*(M19/100)*calcoli!H12))+calcoli!H10+LCC!M29),0)","v":0},null,{"$f":"IF(CELL(\"contents\",O19)>0,IF($C$81=\"Use default OECD-FAO values\",-PV($E$7*0.01,$E$6,calcoli!I9+calcoli!I10+LCC!O29),-PV($E$7*0.01,$E$6,(O21*(O19/100)*calcoli!I11)+(O$25*(O19/100)*calcoli!I12))+calcoli!I10+LCC!O29),0)","v":0},null,{"$f":"IF(CELL(\"contents\",Q19)>0,IF($C$81=\"Use default OECD-FAO values\",-PV($E$7*0.01,$E$6,calcoli!J9+calcoli!J10+LCC!Q29),-PV($E$7*0.01,$E$6,(Q21*(Q19/100)*calcoli!J11)+(Q$25*(Q19/100)*calcoli!J12))+calcoli!J10+LCC!Q29),0)","v":0},null,{"$f":"IF(CELL(\"contents\",S19)>0,IF($C$81=\"Use default OECD-FAO values\",-PV($E$7*0.01,$E$6,calcoli!K9+calcoli!K10+LCC!S29),-PV($E$7*0.01,$E$6,(S21*(S19/100)*calcoli!K11)+(S$25*(S19/100)*calcoli!K12))+calcoli!K10+LCC!S29),0)","v":0},null,{"$f":"IF(CELL(\"contents\",U19)>0,IF($C$81=\"Use default OECD-FAO values\",-PV($E$7*0.01,$E$6,calcoli!L9+calcoli!L10+LCC!U29),-PV($E$7*0.01,$E$6,(U21*(U19/100)*calcoli!L11)+(U$25*(U19/100)*calcoli!L12))+calcoli!L10+LCC!U29),0)","v":0},null,{"$f":"IF(CELL(\"contents\",W19)>0,IF($C$81=\"Use default OECD-FAO values\",-PV($E$7*0.01,$E$6,calcoli!M9+calcoli!M10+LCC!W29),-PV($E$7*0.01,$E$6,(W21*(W19/100)*calcoli!M11)+(W$25*(W19/100)*calcoli!M12))+calcoli!M10+LCC!W29),0)","v":0}]
[]
[null,"COSTI DI MANUTENZIONE PER VEICOLO "]
[null,"i","costi stimati annuali manutenzione","€/unità/anno",null,"€/unità/anno",null,"€/unità/anno",null,"€/unità/anno",null,"€/unità/anno",null,"€/unità/anno",null,"€/unità/anno",null,"€/unità/anno",null,"€/unità/anno",null,"€/unità/anno"]
[null,"i","(o) costo annuale del servizio","€/unità/anno",null,"€/unità/anno",null,"€/unità/anno",null,"€/unità/anno",null,"€/unità/anno",null,"€/unità/anno",null,"€/unità/anno",null,"€/unità/anno",null,"€/unità/anno",null,"€/unità/anno"]
[null,null,"COSTI DI MANUTENZIONE / unità",null,{"$f":"IF(CELL(\"contents\",E33)>0,-PV($E$7*0.01,$E$6,(E34+E33)),IF(CELL(\"type\",E34)=\"v\",-PV($E$7*0.01,$E$6,(E34+E33)),0))","v":0},null,{"$f":"IF(CELL(\"contents\",G33)>0,-PV($E$7*0.01,$E$6,(G34+G33)),IF(CELL(\"type\",G34)=\"v\",-PV($E$7*0.01,$E$6,(G34+G33)),0))","v":0},null,{"$f":"IF(CELL(\"contents\",I33)>0,-PV($E$7*0.01,$E$6,(I34+I33)),IF(CELL(\"type\",I34)=\"v\",-PV($E$7*0.01,$E$6,(I34+I33)),0))","v":0},null,{"$f":"IF(CELL(\"contents\",K33)>0,-PV($E$7*0.01,$E$6,(K34+K33)),IF(CELL(\"type\",K34)=\"v\",-PV($E$7*0.01,$E$6,(K34+K33)),0))","v":0},null,{"$f":"IF(CELL(\"contents\",M33)>0,-PV($E$7*0.01,$E$6,(M34+M33)),IF(CELL(\"type\",M34)=\"v\",-PV($E$7*0.01,$E$6,(M34+M33)),0))","v":0},null,{"$f":"IF(CELL(\"contents\",O33)>0,-PV($E$7*0.01,$E$6,(O34+O33)),IF(CELL(\"type\",O34)=\"v\",-PV($E$7*0.01,$E$6,(O34+O33)),0))","v":0},null,{"$f":"IF(CELL(\"contents\",Q33)>0,-PV($E$7*0.01,$E$6,(Q34+Q33)),IF(CELL(\"type\",Q34)=\"v\",-PV($E$7*0.01,$E$6,(Q34+Q33)),0))","v":0},null,{"$f":"IF(CELL(\"contents\",S33)>0,-PV($E$7*0.01,$E$6,(S34+S33)),IF(CELL(\"type\",S34)=\"v\",-PV($E$7*0.01,$E$6,(S34+S33)),0))","v":0},null,{"$f":"IF(CELL(\"contents\",U33)>0,-PV($E$7*0.01,$E$6,(U34+U33)),IF(CELL(\"type\",U34)=\"v\",-PV($E$7*0.01,$E$6,(U34+U33)),0))","v":0},null,{"$f":"IF(CELL(\"contents\",W33)>0,-PV($E$7*0.01,$E$6,(W34+W33)),IF(CELL(\"type\",W34)=\"v\",-PV($E$7*0.01,$E$6,(W34+W33)),0))","v":0}]
[]
[null,"TASSE E ALTRI COSTI/SUSSIDI PER I VEICOLI "]
[null,"i","tasse","€/unità/anno",null,"€/unità/anno",null,"€/unità/anno",null,"€/unità/anno",null,"€/unità/anno",null,"€/unità/anno",null,"€/unità/anno",null,"€/unità/anno",null,"€/unità/anno",null,"€/unità/anno"]
[null,null,"assicurazione","€/unità/anno",null,"€/unità/anno",null,"€/unità/anno",null,"€/unità/anno",null,"€/unità/anno",null,"€/unità/anno",null,"€/unità/anno",null,"€/unità/anno",null,"€/unità/anno",null,"€/unità/anno"]
[null,"i","infrastrutture - investimenti","€",null,"€",null,"€",null,"€",null,"€",null,"€",null,"€",null,"€",null,"€",null,"€"]
[null,null,"(o) infrastrutture costi annuali","€/anno",null,"€/anno",null,"€/anno",null,"€/anno",null,"€/anno",null,"€/anno",null,"€/anno",null,"€/anno",null,"€/anno",null,"€/anno"]
[null,"i","Altri costi e sussidi"]
[null,null,"(costo annuale 1)","€/anno",null,"€/anno",null,"€/anno",null,"€/anno",null,"€/anno",null,"€/anno",null,"€/anno",null,"€/anno",null,"€/anno",null,"€/anno"]
[null,null,"(costo annuale 2)","€/anno",null,"€/anno",null,"€/anno",null,"€/anno",null,"€/anno",null,"€/anno",null,"€/anno",null,"€/anno",null,"€/anno",null,"€/anno"]
[null,null,"(costo iniziale 1)","€",null,"€",null,"€",null,"€",null,"€",null,"€",null,"€",null,"€",null,"€",null,"€"]
[null,null,"(costo iniziale 2)","€",null,"€",null,"€",null,"€",null,"€",null,"€",null,"€",null,"€",null,"€",null,"€"]
[null,null,"(sussidi annuali)","€",null,"€",null,"€",null,"€",null,"€",null,"€",null,"€",null,"€",null,"€",null,"€"]
[null,null,"(sussidi iniziali)","€",null,"€",null,"€",null,"€",null,"€",null,"€",null,"€",null,"€",null,"€",null,"€"]
[null,null,"TOTALE ALTRI COSTI E SUSSIDI/ unitàA'",null,{"$f":"-PV(E7*0.01,E6,(E38+E39+E41+E43+E44-E47))+E40+E45+E46-E48","v":0},null,{"$f":"-PV($E$7*0.01,$E$6,(G38+G39+G41+G43+G44-G47))+G40+G45+G46-G48","v":0},null,{"$f":"-PV($E$7*0.01,$E$6,(I38+I39+I41+I43+I44-I47))+I40+I45+I46-I48","v":0},null,{"$f":"-PV($E$7*0.01,$E$6,(K38+K39+K41+K43+K44-K47))+K40+K45+K46-K48","v":0},null,{"$f":"-PV($E$7*0.01,$E$6,(M38+M39+M41+M43+M44-M47))+M40+M45+M46-M48","v":0},null,{"$f":"-PV($E$7*0.01,$E$6,(O38+O39+O41+O43+O44-O47))+O40+O45+O46-O48","v":0},null,{"$f":"-PV($E$7*0.01,$E$6,(Q38+Q39+Q41+Q43+Q44-Q47))+Q40+Q45+Q46-Q48","v":0},null,{"$f":"-PV($E$7*0.01,$E$6,(S38+S39+S41+S43+S44-S47))+S40+S45+S46-S48","v":0},null,{"$f":"-PV($E$7*0.01,$E$6,(U38+U39+U41+U43+U44-U47))+U40+U45+U46-U48","v":0},null,{"$f":"-PV($E$7*0.01,$E$6,(W38+W39+W41+W43+W44-W47))+W40+W45+W46-W48","v":0}]
[]
[null,"EMISSIONI (OLC) PER VEICOLO - SEZIONE OPZIONALE"]
[null,null,"vuoi applicare la metodologia OLC delle direttiva?"]
[null,"i","Emissioni CO2 ","g/km",null,"g/km",null,"g/km",null,"g/km",null,"g/km",null,"g/km",null,"g/km",null,"g/km",null,"g/km",null,"g/km"]
[null,null,"costo di vita delle emissioni CO2  / unità",null,{"$f":"$D$77*E53*E19*$E$6","v":0},null,{"$f":"$D$77*G53*G19*$E$6","v":0},null,{"$f":"$D$77*I53*I19*$E$6","v":0},null,{"$f":"$D$77*K53*K19*$E$6","v":0},null,{"$f":"$D$77*M53*M19*$E$6","v":0},null,{"$f":"$D$77*O53*O19*$E$6","v":0},null,{"$f":"$D$77*Q53*Q19*$E$6","v":0},null,{"$f":"$D$77*S53*S19*$E$6","v":0},null,{"$f":"$D$77*U53*U19*$E$6","v":0},null,{"$f":"$D$77*W53*W19*$E$6","v":0}]
[null,"i","NOx (ossidi di azoto)","g/km",null,"g/km",null,"g/km",null,"g/km",null,"g/km",null,"g/km",null,"g/km",null,"g/km",null,"g/km",null,"g/km"]
[null,"i","PM (Particolato)","g/km",null,"g/km",null,"g/km",null,"g/km",null,"g/km",null,"g/km",null,"g/km",null,"g/km",null,"g/km",null,"g/km"]
[null,"i","NMHC (idrocarburi non metanici)","g/km",null,"g/km",null,"g/km",null,"g/km",null,"g/km",null,"g/km",null,"g/km",null,"g/km",null,"g/km",null,"g/km"]
[null,null,"costo di vita degli inquinanti / unità",null,{"$f":"((E55*$D$74)+(E56*$D$75)+(E57*$D$76))*E19*$E$6","v":0},null,{"$f":"((G55*$D$74)+(G56*$D$75)+(G57*$D$76))*G19*$E$6","v":0},null,{"$f":"((I55*$D$74)+(I56*$D$75)+(I57*$D$76))*I19*$E$6","v":0},null,{"$f":"((K55*$D$74)+(K56*$D$75)+(K57*$D$76))*K19*$E$6","v":0},null,{"$f":"((M55*$D$74)+(M56*$D$75)+(M57*$D$76))*M19*$E$6","v":0},null,{"$f":"((O55*$D$74)+(O56*$D$75)+(O57*$D$76))*O19*$E$6","v":0},null,{"$f":"((Q55*$D$74)+(Q56*$D$75)+(Q57*$D$76))*Q19*$E$6","v":0},null,{"$f":"((S55*$D$74)+(S56*$D$75)+(S57*$D$76))*S19*$E$6","v":0},null,{"$f":"((U55*$D$74)+(U56*$D$75)+(U57*$D$76))*U19*$E$6","v":0},null,{"$f":"((W55*$D$74)+(W56*$D$75)+(W57*$D$76))*W19*$E$6","v":0}]
[null,"i","carburante di riferimento (il più economico senza tasse)"]
[null,"i","Costo di riferimento del carburante (prima delle tasse)","€/l",null,"€/l",null,"€/l",null,"€/l",null,"€/l",null,"€/l",null,"€/l",null,"€/l",null,"€/l",null,"€/l"]
[null,null,"costo di vita del consumo di energia  / unità",null,{"$f":"IF(CELL(\"contents\",E60)>0,calcoli!D22,0)","v":0},null,{"$f":"IF(CELL(\"contents\",G60)>0,calcoli!E22,0)","v":0},null,{"$f":"IF(CELL(\"contents\",I60)>0,calcoli!F22,0)","v":0},null,{"$f":"IF(CELL(\"contents\",K60)>0,calcoli!G22,0)","v":0},null,{"$f":"IF(CELL(\"contents\",M60)>0,calcoli!H22,0)","v":0},null,{"$f":"IF(CELL(\"contents\",O60)>0,calcoli!I22,0)","v":0},null,{"$f":"IF(CELL(\"contents\",Q60)>0,calcoli!J22,0)","v":0},null,{"$f":"IF(CELL(\"contents\",S60)>0,calcoli!K22,0)","v":0},null,{"$f":"IF(CELL(\"contents\",U60)>0,calcoli!L22,0)","v":0},null,{"$f":"IF(CELL(\"contents\",W60)>0,calcoli!M22,0)","v":0}]
[null,null,"COSTO OPERATIVO DI VITA  (OLC) / unità",null,{"$f":"SUM(E54,E58,E61)","v":0},null,{"$f":"SUM(G54,G58,G61)","v":0},null,{"$f":"SUM(I54,I58,I61)","v":0},null,{"$f":"SUM(K54,K58,K61)","v":0},null,{"$f":"SUM(M54,M58,M61)","v":0},null,{"$f":"SUM(O54,O58,O61)","v":0},null,{"$f":"SUM(Q54,Q58,Q61)","v":0},null,{"$f":"SUM(S54,S58,S61)","v":0},null,{"$f":"SUM(U54,U58,U61)","v":0},null,0]
[]
[null,"END OF LIFE"]
[null,"i","valore residuale (fine del contratto)","€/unità"]
[null,null,null,null,{"$f":"SUM(E65)","v":0},null,{"$f":"SUM(G65)","v":0},null,{"$f":"SUM(I65)","v":0},null,{"$f":"SUM(K65)","v":0},null,{"$f":"SUM(M65)","v":0},null,{"$f":"SUM(O65)","v":0},null,{"$f":"SUM(Q65)","v":0},null,{"$f":"SUM(S65)","v":0},null,{"$f":"SUM(U65)","v":0},null,{"$f":"SUM(W65)","v":0}]
[]
[null,null," LCC TOTALE per unità",null,{"$f":"E16+E30+E35+E49+E62-E66","v":0},null,{"$f":"G16+G30+G35+G49+G62-G66","v":0},null,{"$f":"I16+I30+I35+I49+I62-I66","v":0},null,{"$f":"K16+K30+K35+K49+K62-K66","v":0},null,{"$f":"M16+M30+M35+M49+M62-M66","v":0},null,{"$f":"O16+O30+O35+O49+O62-O66","v":0},null,{"$f":"Q16+Q30+Q35+Q49+Q62-Q66","v":0},null,{"$f":"S16+S30+S35+S49+S62-S66","v":0},null,{"$f":"U16+U30+U35+U49+U62-U66","v":0},null,{"$f":"W16+W30+W35+W49+W62-W66","v":0}]
[null,null,"LCC TOTALE",null,{"$f":"E68*E13","v":0},null,{"$f":"G68*G13","v":0},null,{"$f":"I68*I13","v":0},null,{"$f":"K68*K13","v":0},null,{"$f":"M68*M13","v":0},null,{"$f":"O68*O13","v":0},null,{"$f":"Q68*Q13","v":0},null,{"$f":"S68*S13","v":0},null,{"$f":"U68*U13","v":0},null,{"$f":"W68*W13","v":0}]
[]
[]
[null,"COSTO DELLE EMISSIONI",null,null,null,">","CLICCA QUI PER I DIAGRAMMI"]
[null,null,"emissioni","Costo per unità €/g"]
[null,null,"NOx  (range consentito 0,0044-0,0088)",4.4000000000000003E-3]
[null,null,"PM  (range consentito 0,087-0,174)",8.6999999999999994E-2]
[null,null,"NMHC  (range consentito 0,001-0,002)",1E-3]
[null,null,"CO2  (range consentito 0,00003 - 0,00008)",3.0000000000000001E-5]
[]
[null,"AUMENTO PREZZO CARBURANTE"]
[null,null,"seleziona una delle opzioni sotto"]
[null,"i","scegli uno dei valori"]
[]
[null,null,"Annual carburante price changes %"]
[null,null,"Diesel",{"$f":"D98","v":""}]
[null,null,"benzina",{"$f":"D99","v":""}]
[null,null,"Biogas/CBG"]
[null,null,"Gas Naturale/CNG (Nm3/100km)",{"$f":"D101","v":""}]
[null,null,"Gas naturale/CNG (kg/100km)",{"$f":"D101","v":""}]
[null,null,"elettricità",{"$f":"D103","v":""}]
[null,null,"biodiesel",{"$f":"D104","v":""}]
[null,null,"LPG",{"$f":"D105","v":""}]
[null,null,"etanolo",{"$f":"D106","v":""}]
[null,null,"idrogeno gas"]
[null,null,"idrogeno liquido - kg/100km"]
[null,null,"idrogeno liquido - l/100km"]
[null,null,"Carburante emulsionato "]
[null,null,null,"inserisci le tue percentuali di incremento annuali nel box sotto"]
[null,null,"Diesel",{"$f":"IF(CELL(\"contents\",E6)>0,INDEX('prezzi combustibile'!$D$6:$N$6,LCC!$E$6)/LCC!$E$6,\"\")","v":""}]
[null,null,"benzina",{"$f":"IF(CELL(\"contents\",E6)>0,INDEX('prezzi combustibile'!$D$9:$N$9,LCC!$E$6)/LCC!$E$6,\"\")","v":""}]
[null,null,"Biogas/CBG"]
[null,null,"Natural Gas/CNG (Nm3/100km)",{"$f":"IF(CELL(\"contents\",E6)>0,INDEX('prezzi combustibile'!$D$24:$N$24,LCC!$E$6)/LCC!$E$6,\"\")","v":""}]
[null,null,"Natural Gas/CNG (kg/100km)",{"$f":"IF(CELL(\"contents\",E6)>0,INDEX('prezzi combustibile'!$D$24:$N$24,LCC!$E$6)/LCC!$E$6,\"\")","v":""}]
[null,null,"elettricità",{"$f":"IF(CELL(\"contents\",E6)>0,INDEX('prezzi combustibile'!$D$18:$N$18,LCC!$E$6)/LCC!$E$6,\"\")","v":""}]
[null,null,"biodiesel",{"$f":"IF(CELL(\"contents\",E6)>0,INDEX('prezzi combustibile'!$D$21:$N$21,LCC!$E$6)/LCC!$E$6,\"\")","v":""}]
[null,null,"LPG",{"$f":"IF(CELL(\"contents\",E6)>0,INDEX('prezzi combustibile'!$D$12:$N$12,LCC!$E$6)/LCC!$E$6,\"\")","v":""}]
[null,null,"etanolo",{"$f":"IF(CELL(\"contents\",E6)>0,INDEX('prezzi combustibile'!$D$15:$N$15,LCC!$E$6)/LCC!$E$6,\"\")","v":""}]
[null,null,"idrogeno gas"]
[null,null,"idrogeno liquido - kg/100km"]
[null,null,"idrogeno liquido - l/100km"]
[null,null," carburante emulsionato"]

{"sheet":"Diagramma","index":2,"n_rows":27,"n_cols":31,"rows_kept":27,"cut":false,"hidden":true,"merged":[[2,1,2,25],[26,3,26,5],[27,3,27,6]]}
[]
[]
[null,"DIAGRAMMA DEI RISULTATI LCC"]
[]
[]
[]
[]
[]
[]
[null,null,null,null,null,null,null,null,null,null,null,null,null,null,null,null,null,null,null,null,null,null,null,null,null,null,null,null,null,null,"OLC"]
[]
[null,null,null,null,null,null,null,null,null,null,null,null,null,null,null,null,null,null,null,null,null,null,null,null,null,null,null,null,null,null,"costi carburante"]
[]
[null,null,null,null,null,null,null,null,null,null,null,null,null,null,null,null,null,null,null,null,null,null,null,null,null,null,null,null,null,null,"totale altri costi"]
[]
[null,null,null,null,null,null,null,null,null,null,null,null,null,null,null,null,null,null,null,null,null,null,null,null,null,null,null,null,null,null,"costi di manutenzione"]
[]
[null,null,null,null,null,null,null,null,null,null,null,null,null,null,null,null,null,null,null,null,null,null,null,null,null,null,null,null,null,null,"costi di acquisizione *"]
[]
[]
[]
[]
[null,null,null,null,null,null,null,null,null,null,null,null,null,null,null,null,null,null,null,null,null,null,null,null,null,null,null,null,null,null,"*se esiste un valore residuale verrà sottratto dal costo di acquisizione "]
[]
[]
[]
[null,null,">","TORNA AL CALCOLATORE LCC"]

{"sheet":"prezzi combustibile","index":3,"n_rows":97,"n_cols":51,"rows_kept":97,"cut":false,"hidden":true,"merged":[[39,1,40,1],[27,1,28,1],[29,1,30,1],[31,1,32,1],[33,1,34,1],[35,1,36,1],[37,1,38,1]]}
["fonti:",null,"OECD-FAO \n",null,null,null,null,null,null,null,null,null,null,null,null,null,null,null,null,null,null,null,null,"SINGLE FUEL TIME SERIES",null,null,null,null,null,null,null,null,null,null,null,null,"Fuel 1\nTime Series","SECOND FUEL TIME SERIES",null,null,null,null,null,null,null,null,null,null,null,null,"Fuel 2\nTime Series"]
[null,null,"amministazione energia US ",null,null,null,null,null,"5 anni",null,null,null,null,"10 anni"]
[null,null,null,2014,2015,2016,2017,2018,2019,2020,2021,2022,2023,2024,null,null,null,null,null,null,null,null,null,"DIESEL",2014,2015,2016,2017,2018,2019,2020,2021,2022,2023,2024,"Total fuel price for period",null,"DIESEL",2014,2015,2016,2017,2018,2019,2020,2021,2022,2023,2024,"prezzo totale carburante per il periodo"]
["Diesel ","$/gallonee","prezzo previsto",3.6833300000000002,3.5441319999999998,3.4952230000000002,3.4971399999999999,3.533868,3.6106159999999998,3.671875,3.7407020000000002,3.815766,3.868004,3.9180830000000002,null,null,null,null,null,null,null,null,null,"prodotto 1",{"$f":"((LCC!$E$19*(LCC!$E$21/100))*LCC!$E$22)","v":0},{"$f":"((LCC!$E$19*(LCC!$E$21/100))*(LCC!$E$22*(1+$E$6)))","v":0},{"$f":"((LCC!$E$19*(LCC!$E$21/100))*(LCC!$E$22*(1+$F$6)))","v":0},{"$f":"((LCC!$E$19*(LCC!$E$21/100))*(LCC!$E$22*(1+$G$6)))","v":0},{"$f":"((LCC!$E$19*(LCC!$E$21/100))*(LCC!$E$22*(1+$H$6)))","v":0},{"$f":"((LCC!$E$19*(LCC!$E$21/100))*(LCC!$E$22*(1+$I$6)))","v":0},{"$f":"((LCC!$E$19*(LCC!$E$21/100))*(LCC!$E$22*(1+$J$6)))","v":0},{"$f":"((LCC!$E$19*(LCC!$E$21/100))*(LCC!$E$22*(1+$K$6)))","v":0},{"$f":"((LCC!$E$19*(LCC!$E$21/100))*(LCC!$E$22*(1+$L$6)))","v":0},{"$f":"((LCC!$E$19*(LCC!$E$21/100))*(LCC!$E$22*(1+$M$6)))","v":0},{"$f":"((LCC!$E$19*(LCC!$E$21/100))*(LCC!$E$22*(1+$N$6)))","v":0},{"$f":"SUM(Y4:INDEX(Y4:AI4,LCC!$E$6))","v":0},null,"prodotto 1",{"$f":"((LCC!$E$19*(LCC!$E$25/100))*LCC!$E$26)","v":0},{"$f":"((LCC!$E$19*(LCC!$E$25/100))*(LCC!$E$26*(1+$E$6)))","v":0},{"$f":"((LCC!$E$19*(LCC!$E$25/100))*(LCC!$E$26*(1+$F$6)))","v":0},{"$f":"((LCC!$E$19*(LCC!$E$25/100))*(LCC!$E$26*(1+$G$6)))","v":0},{"$f":"((LCC!$E$19*(LCC!$E$25/100))*(LCC!$E$26*(1+$H$6)))","v":0},{"$f":"((LCC!$E$19*(LCC!$E$25/100))*(LCC!$E$26*(1+$I$6)))","v":0},{"$f":"((LCC!$E$19*(LCC!$E$25/100))*(LCC!$E$26*(1+$J$6)))","v":0},{"$f":"((LCC!$E$19*(LCC!$E$25/100))*(LCC!$E$26*(1+$K$6)))","v":0},{"$f":"((LCC!$E$19*(LCC!$E$25/100))*(LCC!$E$26*(1+$L$6)))","v":0},{"$f":"((LCC!$E$19*(LCC!$E$25/100))*(LCC!$E$26*(1+$M$6)))","v":0},{"$f":"((LCC!$E$19*(LCC!$E$25/100))*(LCC!$E$26*(1+$N$6)))","v":0},{"$f":"SUM(AM4:INDEX(AM4:AW4,LCC!$E$6))","v":0}]
[null,null,"% rispetto anni prec",null,{"$f":"(E4-D4)/D4","v":-3.779134641750817E-2},{"$f":"(F4-E4)/E4","v":-1.3799993905418773E-2},5.4846285916513031E-4,1.0502296162006696E-2,2.1717845714667276E-2,1.6966356987284215E-2,1.8744374468085159E-2,2.0066821682133404E-2,1.3690042838056634E-2,1.2946987645307556E-2,null,null,null,null,null,null,null,null,null,"prodotto 2",{"$f":"((LCC!$G$19*(LCC!$G$21/100))*LCC!$G$22)","v":0},{"$f":"((LCC!$G$19*(LCC!$G$21/100))*(LCC!$G$22*(1+$E$6)))","v":0},{"$f":"((LCC!$G$19*(LCC!$G$21/100))*(LCC!$G$22*(1+$F$6)))","v":0},{"$f":"((LCC!$G$19*(LCC!$G$21/100))*(LCC!$G$22*(1+G$6)))","v":0},{"$f":"((LCC!$G$19*(LCC!$G$21/100))*(LCC!$G$22*(1+H$6)))","v":0},{"$f":"((LCC!$G$19*(LCC!$G$21/100))*(LCC!$G$22*(1+I$6)))","v":0},{"$f":"((LCC!$G$19*(LCC!$G$21/100))*(LCC!$G$22*(1+J$6)))","v":0},{"$f":"((LCC!$G$19*(LCC!$G$21/100))*(LCC!$G$22*(1+K$6)))","v":0},{"$f":"((LCC!$G$19*(LCC!$G$21/100))*(LCC!$G$22*(1+L$6)))","v":0},{"$f":"((LCC!$G$19*(LCC!$G$21/100))*(LCC!$G$22*(1+M$6)))","v":0},{"$f":"((LCC!$G$19*(LCC!$G$21/100))*(LCC!$G$22*(1+N$6)))","v":0},{"$f":"SUM(Y5:INDEX(Y5:AI5,LCC!$E$6))","v":0},null,"prodotto 2",{"$f":"((LCC!$G$19*(LCC!$G$25/100))*LCC!$G$26)","v":0},{"$f":"((LCC!$G$19*(LCC!$G$25/100))*(LCC!$G$26*(1+$E$6)))","v":0},{"$f":"((LCC!$G$19*(LCC!$G$25/100))*(LCC!$G$26*(1+$F$6)))","v":0},{"$f":"((LCC!$G$19*(LCC!$G$25/100))*(LCC!$G$26*(1+$G$6)))","v":0},{"$f":"((LCC!$G$19*(LCC!$G$25/100))*(LCC!$G$26*(1+$H$6)))","v":0},{"$f":"((LCC!$G$19*(LCC!$G$25/100))*(LCC!$G$26*(1+$I$6)))","v":0},{"$f":"((LCC!$G$19*(LCC!$G$25/100))*(LCC!$G$26*(1+$J$6)))","v":0},{"$f":"((LCC!$G$19*(LCC!$G$25/100))*(LCC!$G$26*(1+$K$6)))","v":0},{"$f":"((LCC!$G$19*(LCC!$G$25/100))*(LCC!$G$26*(1+$L$6)))","v":0},{"$f":"((LCC!$G$19*(LCC!$G$25/100))*(LCC!$G$26*(1+$M$6)))","v":0},{"$f":"((LCC!$G$19*(LCC!$G$25/100))*(LCC!$G$26*(1+$N$6)))","v":0},{"$f":"SUM(AM5:INDEX(AM5:AW5,LCC!$E$6))","v":0}]
[null,null,"% cumulativa",null,{"$f":"E5","v":-3.779134641750817E-2},{"$f":"F5+E6","v":-5.1591340322926942E-2},{"$f":"G5+F6","v":-5.1042877463761814E-2},-4.054058130175512E-2,-1.8822735587087844E-2,-1.8563785998036292E-3,1.6887995868281529E-2,3.6954817550414937E-2,5.0644860388471574E-2,6.3591848033779125E-2,null,null,null,null,null,null,null,null,null,"prodotto 3",{"$f":"((LCC!$I$19*(LCC!$I$21/100))*LCC!$I$22)","v":0},{"$f":"((LCC!$I$19*(LCC!$I$21/100))*(LCC!$I$22*(1+$E$6)))","v":0},{"$f":"((LCC!$I$19*(LCC!$I$21/100))*(LCC!$I$22*(1+$F$6)))","v":0},{"$f":"((LCC!$I$19*(LCC!$I$21/100))*(LCC!$I$22*(1+G$6)))","v":0},{"$f":"((LCC!$I$19*(LCC!$I$21/100))*(LCC!$I$22*(1+H$6)))","v":0},{"$f":"((LCC!$I$19*(LCC!$I$21/100))*(LCC!$I$22*(1+I$6)))","v":0},{"$f":"((LCC!$I$19*(LCC!$I$21/100))*(LCC!$I$22*(1+J$6)))","v":0},{"$f":"((LCC!$I$19*(LCC!$I$21/100))*(LCC!$I$22*(1+K$6)))","v":0},{"$f":"((LCC!$I$19*(LCC!$I$21/100))*(LCC!$I$22*(1+L$6)))","v":0},{"$f":"((LCC!$I$19*(LCC!$I$21/100))*(LCC!$I$22*(1+M$6)))","v":0},{"$f":"((LCC!$I$19*(LCC!$I$21/100))*(LCC!$I$22*(1+N$6)))","v":0},{"$f":"SUM(Y6:INDEX(Y6:AI6,LCC!$E$6))","v":0},null,"prodotto 3",{"$f":"((LCC!$I$19*(LCC!$I$25/100))*LCC!$I$26)","v":0},{"$f":"((LCC!$I$19*(LCC!$I$25/100))*(LCC!$I$26*(1+$E$6)))","v":0},{"$f":"((LCC!$I$19*(LCC!$I$25/100))*(LCC!$I$26*(1+$F$6)))","v":0},{"$f":"((LCC!$I$19*(LCC!$I$25/100))*(LCC!$I$26*(1+$G$6)))","v":0},{"$f":"((LCC!$I$19*(LCC!$I$25/100))*(LCC!$I$26*(1+$H$6)))","v":0},{"$f":"((LCC!$I$19*(LCC!$I$25/100))*(LCC!$I$26*(1+$I$6)))","v":0},{"$f":"((LCC!$I$19*(LCC!$I$25/100))*(LCC!$I$26*(1+$J$6)))","v":0},{"$f":"((LCC!$I$19*(LCC!$I$25/100))*(LCC!$I$26*(1+$K$6)))","v":0},{"$f":"((LCC!$I$19*(LCC!$I$25/100))*(LCC!$I$26*(1+$L$6)))","v":0},{"$f":"((LCC!$I$19*(LCC!$I$25/100))*(LCC!$I$26*(1+$M$6)))","v":0},{"$f":"((LCC!$I$19*(LCC!$I$25/100))*(LCC!$I$26*(1+$N$6)))","v":0},{"$f":"SUM(AM6:INDEX(AM6:AW6,LCC!$E$6))","v":0}]
["benzina","$/gallone","prezzo previsto",3.3808379999999998,3.1774,3.0719460000000001,3.0273970000000001,3.0207419999999998,3.0347240000000002,3.077188,3.1208870000000002,3.1696469999999999,3.220602,3.261647,null,null,null,null,null,null,null,null,null,"prodotto 4",{"$f":"((LCC!$K$19*(LCC!$K$21/100))*LCC!$K$22)","v":0},{"$f":"((LCC!$K$19*(LCC!$K$21/100))*(LCC!$K$22*(1+$E$6)))","v":0},{"$f":"((LCC!$K$19*(LCC!$K$21/100))*(LCC!$K$22*(1+$F$6)))","v":0},{"$f":"((LCC!$K$19*(LCC!$K$21/100))*(LCC!$K$22*(1+G$6)))","v":0},{"$f":"((LCC!$K$19*(LCC!$K$21/100))*(LCC!$K$22*(1+H$6)))","v":0},{"$f":"((LCC!$K$19*(LCC!$K$21/100))*(LCC!$K$22*(1+I$6)))","v":0},{"$f":"((LCC!$K$19*(LCC!$K$21/100))*(LCC!$K$22*(1+J$6)))","v":0},{"$f":"((LCC!$K$19*(LCC!$K$21/100))*(LCC!$K$22*(1+K$6)))","v":0},{"$f":"((LCC!$K$19*(LCC!$K$21/100))*(LCC!$K$22*(1+L$6)))","v":0},{"$f":"((LCC!$K$19*(LCC!$K$21/100))*(LCC!$K$22*(1+M$6)))","v":0},{"$f":"((LCC!$K$19*(LCC!$K$21/100))*(LCC!$K$22*(1+N$6)))","v":0},{"$f":"SUM(Y7:INDEX(Y7:AI7,LCC!$E$6))","v":0},null,"prodotto 4",{"$f":"((LCC!$K$19*(LCC!$K$25/100))*LCC!$K$26)","v":0},{"$f":"((LCC!$K$19*(LCC!$K$25/100))*(LCC!$K$26*(1+$E$6)))","v":0},{"$f":"((LCC!$K$19*(LCC!$K$25/100))*(LCC!$K$26*(1+$F$6)))","v":0},{"$f":"((LCC!$K$19*(LCC!$K$25/100))*(LCC!$K$26*(1+$G$6)))","v":0},{"$f":"((LCC!$K$19*(LCC!$K$25/100))*(LCC!$K$26*(1+$H$6)))","v":0},{"$f":"((LCC!$K$19*(LCC!$K$25/100))*(LCC!$K$26*(1+$I$6)))","v":0},{"$f":"((LCC!$K$19*(LCC!$K$25/100))*(LCC!$K$26*(1+$J$6)))","v":0},{"$f":"((LCC!$K$19*(LCC!$K$25/100))*(LCC!$K$26*(1+$K$6)))","v":0},{"$f":"((LCC!$K$19*(LCC!$K$25/100))*(LCC!$K$26*(1+$L$6)))","v":0},{"$f":"((LCC!$K$19*(LCC!$K$25/100))*(LCC!$K$26*(1+$M$6)))","v":0},{"$f":"((LCC!$K$19*(LCC!$K$25/100))*(LCC!$K$26*(1+$N$6)))","v":0},{"$f":"SUM(AM7:INDEX(AM7:AW7,LCC!$E$6))","v":0}]
[null,null,"%rispetto anni prec",null,{"$f":"(E7-D7)/D7","v":-6.0173838557186062E-2},{"$f":"(F7-E7)/E7","v":-3.3188770693019433E-2},-1.4501882520070323E-2,-2.1982581075426512E-3,4.62866408319558E-3,1.3992705761710071E-2,1.4200952298007191E-2,1.5623763372400118E-2,1.6075922650061691E-2,1.2744511740351648E-2," ",null,null,null,null,null,null,null,null,"prodotto 5",{"$f":"((LCC!$M$19*(LCC!$M$21/100))*LCC!$M$22)","v":0},{"$f":"((LCC!$M$19*(LCC!$M$21/100))*(LCC!$M$22*(1+$E$6)))","v":0},{"$f":"((LCC!$M$19*(LCC!$M$21/100))*(LCC!$M$22*(1+$F$6)))","v":0},{"$f":"((LCC!$M$19*(LCC!$M$21/100))*(LCC!$M$22*(1+G$6)))","v":0},{"$f":"((LCC!$M$19*(LCC!$M$21/100))*(LCC!$M$22*(1+H$6)))","v":0},{"$f":"((LCC!$M$19*(LCC!$M$21/100))*(LCC!$M$22*(1+I$6)))","v":0},{"$f":"((LCC!$M$19*(LCC!$M$21/100))*(LCC!$M$22*(1+J$6)))","v":0},{"$f":"((LCC!$M$19*(LCC!$M$21/100))*(LCC!$M$22*(1+K$6)))","v":0},{"$f":"((LCC!$M$19*(LCC!$M$21/100))*(LCC!$M$22*(1+L$6)))","v":0},{"$f":"((LCC!$M$19*(LCC!$M$21/100))*(LCC!$M$22*(1+M$6)))","v":0},{"$f":"((LCC!$M$19*(LCC!$M$21/100))*(LCC!$M$22*(1+N$6)))","v":0},{"$f":"SUM(Y8:INDEX(Y8:AI8,LCC!$E$6))","v":0},null,"prodotto 5",{"$f":"((LCC!$M$19*(LCC!$M$25/100))*LCC!$M$26)","v":0},{"$f":"((LCC!$M$19*(LCC!$M$25/100))*(LCC!$M$26*(1+$E$6)))","v":0},{"$f":"((LCC!$M$19*(LCC!$M$25/100))*(LCC!$M$26*(1+$F$6)))","v":0},{"$f":"((LCC!$M$19*(LCC!$M$25/100))*(LCC!$M$26*(1+$G$6)))","v":0},{"$f":"((LCC!$M$19*(LCC!$M$25/100))*(LCC!$M$26*(1+$H$6)))","v":0},{"$f":"((LCC!$M$19*(LCC!$M$25/100))*(LCC!$M$26*(1+$I$6)))","v":0},{"$f":"((LCC!$M$19*(LCC!$M$25/100))*(LCC!$M$26*(1+$J$6)))","v":0},{"$f":"((LCC!$M$19*(LCC!$M$25/100))*(LCC!$M$26*(1+$K$6)))","v":0},{"$f":"((LCC!$M$19*(LCC!$M$25/100))*(LCC!$M$26*(1+$L$6)))","v":0},{"$f":"((LCC!$M$19*(LCC!$M$25/100))*(LCC!$M$26*(1+$M$6)))","v":0},{"$f":"((LCC!$M$19*(LCC!$M$25/100))*(LCC!$M$26*(1+$N$6)))","v":0},{"$f":"SUM(AM8:INDEX(AM8:AW8,LCC!$E$6))","v":0}]
[null,null,"%cumulativa",null,{"$f":"E8","v":-6.0173838557186062E-2},{"$f":"F8+E9","v":-9.3362609250205494E-2},{"$f":"G8+F9","v":-0.10786449177027582},-0.11006274987781847,-0.10543408579462289,-9.1441380032912828E-2,-7.7240427734905637E-2,-6.161666436250552E-2,-4.5540741712443829E-2,-3.2796229972092181E-2,null,null,null,null,null,null,null,null,null,"prodotto 6",{"$f":"((LCC!$O$19*(LCC!$O$21/100))*LCC!$O$22)","v":0},{"$f":"((LCC!$O$19*(LCC!$O$21/100))*(LCC!$O$22*(1+$E$6)))","v":0},{"$f":"((LCC!$O$19*(LCC!$O$21/100))*(LCC!$O$22*(1+$F$6)))","v":0},{"$f":"((LCC!$O$19*(LCC!$O$21/100))*(LCC!$O$22*(1+G$6)))","v":0},{"$f":"((LCC!$O$19*(LCC!$O$21/100))*(LCC!$O$22*(1+H$6)))","v":0},{"$f":"((LCC!$O$19*(LCC!$O$21/100))*(LCC!$O$22*(1+I$6)))","v":0},{"$f":"((LCC!$O$19*(LCC!$O$21/100))*(LCC!$O$22*(1+J$6)))","v":0},{"$f":"((LCC!$O$19*(LCC!$O$21/100))*(LCC!$O$22*(1+K$6)))","v":0},{"$f":"((LCC!$O$19*(LCC!$O$21/100))*(LCC!$O$22*(1+L$6)))","v":0},{"$f":"((LCC!$O$19*(LCC!$O$21/100))*(LCC!$O$22*(1+M$6)))","v":0},{"$f":"((LCC!$O$19*(LCC!$O$21/100))*(LCC!$O$22*(1+N$6)))","v":0},{"$f":"SUM(Y9:INDEX(Y9:AI9,LCC!$E$6))","v":0},null,"prodotto 6",{"$f":"((LCC!$O$19*(LCC!$O$25/100))*LCC!$O$26)","v":0},{"$f":"((LCC!$O$19*(LCC!$O$25/100))*(LCC!$O$26*(1+$E$6)))","v":0},{"$f":"((LCC!$O$19*(LCC!$O$25/100))*(LCC!$O$26*(1+$F$6)))","v":0},{"$f":"((LCC!$O$19*(LCC!$O$25/100))*(LCC!$O$26*(1+$G$6)))","v":0},{"$f":"((LCC!$O$19*(LCC!$O$25/100))*(LCC!$O$26*(1+$H$6)))","v":0},{"$f":"((LCC!$O$19*(LCC!$O$25/100))*(LCC!$O$26*(1+$I$6)))","v":0},{"$f":"((LCC!$O$19*(LCC!$O$25/100))*(LCC!$O$26*(1+$J$6)))","v":0},{"$f":"((LCC!$O$19*(LCC!$O$25/100))*(LCC!$O$26*(1+$K$6)))","v":0},{"$f":"((LCC!$O$19*(LCC!$O$25/100))*(LCC!$O$26*(1+$L$6)))","v":0},{"$f":"((LCC!$O$19*(LCC!$O$25/100))*(LCC!$O$26*(1+$M$6)))","v":0},{"$f":"((LCC!$O$19*(LCC!$O$25/100))*(LCC!$O$26*(1+$N$6)))","v":0},{"$f":"SUM(AM9:INDEX(AM9:AW9,LCC!$E$6))","v":0}]
["LPG","$/gallone","prezzo previsto",2.1892990000000001,2.1427740000000002,2.1454360000000001,2.1942110000000001,2.2315330000000002,2.2541479999999998,2.2695509999999999,2.294362,2.3139639999999999,2.328557,2.3463189999999998,null,null,null,null,null,null,null,null,null,"prodotto 7",{"$f":"((LCC!$Q$19*(LCC!$Q$21/100))*LCC!$Q$22)","v":0},{"$f":"((LCC!$Q$19*(LCC!$Q$21/100))*(LCC!$Q$22*(1+$E$6)))","v":0},{"$f":"((LCC!$Q$19*(LCC!$Q$21/100))*(LCC!$Q$22*(1+$F$6)))","v":0},{"$f":"((LCC!$Q$19*(LCC!$Q$21/100))*(LCC!$Q$22*(1+G$6)))","v":0},{"$f":"((LCC!$Q$19*(LCC!$Q$21/100))*(LCC!$Q$22*(1+H$6)))","v":0},{"$f":"((LCC!$Q$19*(LCC!$Q$21/100))*(LCC!$Q$22*(1+I$6)))","v":0},{"$f":"((LCC!$Q$19*(LCC!$Q$21/100))*(LCC!$Q$22*(1+J$6)))","v":0},{"$f":"((LCC!$Q$19*(LCC!$Q$21/100))*(LCC!$Q$22*(1+K$6)))","v":0},{"$f":"((LCC!$Q$19*(LCC!$Q$21/100))*(LCC!$Q$22*(1+L$6)))","v":0},{"$f":"((LCC!$Q$19*(LCC!$Q$21/100))*(LCC!$Q$22*(1+M$6)))","v":0},{"$f":"((LCC!$Q$19*(LCC!$Q$21/100))*(LCC!$Q$22*(1+N$6)))","v":0},{"$f":"SUM(Y10:INDEX(Y10:AI10,LCC!$E$6))","v":0},null,"prodotto 7",{"$f":"((LCC!$Q$19*(LCC!$Q$25/100))*LCC!$Q$26)","v":0},{"$f":"((LCC!$Q$19*(LCC!$Q$25/100))*(LCC!$Q$26*(1+$E$6)))","v":0},{"$f":"((LCC!$Q$19*(LCC!$Q$25/100))*(LCC!$Q$26*(1+$F$6)))","v":0},{"$f":"((LCC!$Q$19*(LCC!$Q$25/100))*(LCC!$Q$26*(1+$G$6)))","v":0},{"$f":"((LCC!$Q$19*(LCC!$Q$25/100))*(LCC!$Q$26*(1+$H$6)))","v":0},{"$f":"((LCC!$Q$19*(LCC!$Q$25/100))*(LCC!$Q$26*(1+$I$6)))","v":0},{"$f":"((LCC!$Q$19*(LCC!$Q$25/100))*(LCC!$Q$26*(1+$J$6)))","v":0},{"$f":"((LCC!$Q$19*(LCC!$Q$25/100))*(LCC!$Q$26*(1+$K$6)))","v":0},{"$f":"((LCC!$Q$19*(LCC!$Q$25/100))*(LCC!$Q$26*(1+$L$6)))","v":0},{"$f":"((LCC!$Q$19*(LCC!$Q$25/100))*(LCC!$Q$26*(1+$M$6)))","v":0},{"$f":"((LCC!$Q$19*(LCC!$Q$25/100))*(LCC!$Q$26*(1+$N$6)))","v":0},{"$f":"SUM(AM10:INDEX(AM10:AW10,LCC!$E$6))","v":0}]
[null,null,"% rispetto anni prec",null,{"$f":"(E10-D10)/D10","v":-2.1251094528431214E-2},{"$f":"(F10-E10)/E10","v":1.2423148684835368E-3},2.2734306686379838E-2,1.7009303116245465E-2,1.0134288849862227E-2,6.8331804300339003E-3,1.0932118291239166E-2,8.5435515406896978E-3,6.3064939644696628E-3,7.6279000256381244E-3,null,null,null,null,null,null,null,null,null,"prodotto 8",{"$f":"((LCC!$S$19*(LCC!$S$21/100))*LCC!$S$22)","v":0},{"$f":"((LCC!$S$19*(LCC!$S$21/100))*(LCC!$S$22*(1+$E$6)))","v":0},{"$f":"((LCC!$S$19*(LCC!$S$21/100))*(LCC!$S$22*(1+$F$6)))","v":0},{"$f":"((LCC!$S$19*(LCC!$S$21/100))*(LCC!$S$22*(1+G$6)))","v":0},{"$f":"((LCC!$S$19*(LCC!$S$21/100))*(LCC!$S$22*(1+H$6)))","v":0},{"$f":"((LCC!$S$19*(LCC!$S$21/100))*(LCC!$S$22*(1+I$6)))","v":0},{"$f":"((LCC!$S$19*(LCC!$S$21/100))*(LCC!$S$22*(1+J$6)))","v":0},{"$f":"((LCC!$S$19*(LCC!$S$21/100))*(LCC!$S$22*(1+K$6)))","v":0},{"$f":"((LCC!$S$19*(LCC!$S$21/100))*(LCC!$S$22*(1+L$6)))","v":0},{"$f":"((LCC!$S$19*(LCC!$S$21/100))*(LCC!$S$22*(1+M$6)))","v":0},{"$f":"((LCC!$S$19*(LCC!$S$21/100))*(LCC!$S$22*(1+N$6)))","v":0},{"$f":"SUM(Y11:INDEX(Y11:AI11,LCC!$E$6))","v":0},null,"prodotto 8",{"$f":"((LCC!$S$19*(LCC!$S$25/100))*LCC!$S$26)","v":0},{"$f":"((LCC!$S$19*(LCC!$S$25/100))*(LCC!$S$26*(1+$E$6)))","v":0},{"$f":"((LCC!$S$19*(LCC!$S$25/100))*(LCC!$S$26*(1+$F$6)))","v":0},{"$f":"((LCC!$S$19*(LCC!$S$25/100))*(LCC!$S$26*(1+$G$6)))","v":0},{"$f":"((LCC!$S$19*(LCC!$S$25/100))*(LCC!$S$26*(1+$H$6)))","v":0},{"$f":"((LCC!$S$19*(LCC!$S$25/100))*(LCC!$S$26*(1+$I$6)))","v":0},{"$f":"((LCC!$S$19*(LCC!$S$25/100))*(LCC!$S$26*(1+$J$6)))","v":0},{"$f":"((LCC!$S$19*(LCC!$S$25/100))*(LCC!$S$26*(1+$K$6)))","v":0},{"$f":"((LCC!$S$19*(LCC!$S$25/100))*(LCC!$S$26*(1+$L$6)))","v":0},{"$f":"((LCC!$S$19*(LCC!$S$25/100))*(LCC!$S$26*(1+$M$6)))","v":0},{"$f":"((LCC!$S$19*(LCC!$S$25/100))*(LCC!$S$26*(1+$N$6)))","v":0},{"$f":"SUM(AM11:INDEX(AM11:AW11,LCC!$E$6))","v":0}]
[null,null,"% cumulativa",null,{"$f":"E11","v":-2.1251094528431214E-2},{"$f":"F11+E12","v":-2.0008779659947677E-2},{"$f":"G11+F12","v":2.7255270264321604E-3},1.9734830142677625E-2,2.9869118992539852E-2,3.6702299422573754E-2,4.7634417713812924E-2,5.6177969254502622E-2,6.2484463218972282E-2,7.0112363244610412E-2,null,null,null,null,null,null,null,null,null,"prodotto 9",{"$f":"((LCC!$U$19*(LCC!$U$21/100))*LCC!$U$22)","v":0},{"$f":"((LCC!$U$19*(LCC!$U$21/100))*(LCC!$U$22*(1+$E$6)))","v":0},{"$f":"((LCC!$U$19*(LCC!$U$21/100))*(LCC!$U$22*(1+$F$6)))","v":0},{"$f":"((LCC!$U$19*(LCC!$U$21/100))*(LCC!$U$22*(1+G$6)))","v":0},{"$f":"((LCC!$U$19*(LCC!$U$21/100))*(LCC!$U$22*(1+H$6)))","v":0},{"$f":"((LCC!$U$19*(LCC!$U$21/100))*(LCC!$U$22*(1+I$6)))","v":0},{"$f":"((LCC!$U$19*(LCC!$U$21/100))*(LCC!$U$22*(1+J$6)))","v":0},{"$f":"((LCC!$U$19*(LCC!$U$21/100))*(LCC!$U$22*(1+K$6)))","v":0},{"$f":"((LCC!$U$19*(LCC!$U$21/100))*(LCC!$U$22*(1+L$6)))","v":0},{"$f":"((LCC!$U$19*(LCC!$U$21/100))*(LCC!$U$22*(1+M$6)))","v":0},{"$f":"((LCC!$U$19*(LCC!$U$21/100))*(LCC!$U$22*(1+N$6)))","v":0},{"$f":"SUM(Y12:INDEX(Y12:AI12,LCC!$E$6))","v":0},null,"prodotto 9",{"$f":"((LCC!$U$19*(LCC!$U$25/100))*LCC!$U$26)","v":0},{"$f":"((LCC!$U$19*(LCC!$U$25/100))*(LCC!$U$26*(1+$E$6)))","v":0},{"$f":"((LCC!$U$19*(LCC!$U$25/100))*(LCC!$U$26*(1+$F$6)))","v":0},{"$f":"((LCC!$U$19*(LCC!$U$25/100))*(LCC!$U$26*(1+$G$6)))","v":0},{"$f":"((LCC!$U$19*(LCC!$U$25/100))*(LCC!$U$26*(1+$H$6)))","v":0},{"$f":"((LCC!$U$19*(LCC!$U$25/100))*(LCC!$U$26*(1+$I$6)))","v":0},{"$f":"((LCC!$U$19*(LCC!$U$25/100))*(LCC!$U$26*(1+$J$6)))","v":0},{"$f":"((LCC!$U$19*(LCC!$U$25/100))*(LCC!$U$26*(1+$K$6)))","v":0},{"$f":"((LCC!$U$19*(LCC!$U$25/100))*(LCC!$U$26*(1+$L$6)))","v":0},{"$f":"((LCC!$U$19*(LCC!$U$25/100))*(LCC!$U$26*(1+$M$6)))","v":0},{"$f":"((LCC!$U$19*(LCC!$U$25/100))*(LCC!$U$26*(1+$N$6)))","v":0},{"$f":"SUM(AM12:INDEX(AM12:AW12,LCC!$E$6))","v":0}]
["etanolo","$/gallone","prezzo previsto",2.5707420000000001,2.5745960000000001,2.5772849999999998,2.5795370000000002,2.5812029999999999,2.5974710000000001,2.6644839999999999,2.691967,2.7039330000000001,2.7027369999999999,2.602026,null,null,null,null,null,null,null,null,null,"prodotto 10",{"$f":"((LCC!$W$19*(LCC!$W$21/100))*LCC!$W$22)","v":0},{"$f":"((LCC!$W$19*(LCC!$W$21/100))*(LCC!$W$22*(1+$E$6)))","v":0},{"$f":"((LCC!$W$19*(LCC!$W$21/100))*(LCC!$W$22*(1+$F$6)))","v":0},{"$f":"((LCC!$W$19*(LCC!$W$21/100))*(LCC!$W$22*(1+G$6)))","v":0},{"$f":"((LCC!$W$19*(LCC!$W$21/100))*(LCC!$W$22*(1+H$6)))","v":0},{"$f":"((LCC!$W$19*(LCC!$W$21/100))*(LCC!$W$22*(1+I$6)))","v":0},{"$f":"((LCC!$W$19*(LCC!$W$21/100))*(LCC!$W$22*(1+J$6)))","v":0},{"$f":"((LCC!$W$19*(LCC!$W$21/100))*(LCC!$W$22*(1+K$6)))","v":0},{"$f":"((LCC!$W$19*(LCC!$W$21/100))*(LCC!$W$22*(1+L$6)))","v":0},{"$f":"((LCC!$W$19*(LCC!$W$21/100))*(LCC!$W$22*(1+M$6)))","v":0},{"$f":"((LCC!$W$19*(LCC!$W$21/100))*(LCC!$W$22*(1+N$6)))","v":0},{"$f":"SUM(Y13:INDEX(Y13:AI13,LCC!$E$6))","v":0},null,"prodotto 10",{"$f":"((LCC!$W$19*(LCC!$W$25/100))*LCC!$W$26)","v":0},{"$f":"((LCC!$W$19*(LCC!$W$25/100))*(LCC!$W$26*(1+$E$6)))","v":0},{"$f":"((LCC!$W$19*(LCC!$W$25/100))*(LCC!$W$26*(1+$F$6)))","v":0},{"$f":"((LCC!$W$19*(LCC!$W$25/100))*(LCC!$W$26*(1+$G$6)))","v":0},{"$f":"((LCC!$W$19*(LCC!$W$25/100))*(LCC!$W$26*(1+$H$6)))","v":0},{"$f":"((LCC!$W$19*(LCC!$W$25/100))*(LCC!$W$26*(1+$I$6)))","v":0},{"$f":"((LCC!$W$19*(LCC!$W$25/100))*(LCC!$W$26*(1+$J$6)))","v":0},{"$f":"((LCC!$W$19*(LCC!$W$25/100))*(LCC!$W$26*(1+$K$6)))","v":0},{"$f":"((LCC!$W$19*(LCC!$W$25/100))*(LCC!$W$26*(1+$L$6)))","v":0},{"$f":"((LCC!$W$19*(LCC!$W$25/100))*(LCC!$W$26*(1+$M$6)))","v":0},{"$f":"((LCC!$W$19*(LCC!$W$25/100))*(LCC!$W$26*(1+$N$6)))","v":0},{"$f":"SUM(AM13:INDEX(AM13:AW13,LCC!$E$6))","v":0}]
[null,null,"% rispetto anni prec",null,{"$f":"(E13-D13)/D13","v":1.4991780583193583E-3},{"$f":"(F13-E13)/E13","v":1.0444357095248029E-3},8.7378772623142764E-4,6.4585233706658334E-4,6.3024876385159058E-3,2.5799325574760897E-2,1.0314567473477096E-2,4.4450767784301008E-3,-4.4231865212643838E-4,-3.7262597137642323E-2]
[null,null,"% cumulativa",null,{"$f":"E14","v":1.4991780583193583E-3},{"$f":"F14+E15","v":2.5436137678441612E-3},{"$f":"G14+F15","v":3.4174014940755891E-3},4.0632538311421726E-3,1.0365741469658078E-2,3.6165067044418978E-2,4.6479634517896072E-2,5.0924711296326169E-2,5.0482392644199729E-2,1.3219795506557407E-2,null,null,null,null,null,null,null,null,null,"PETROL",2014,2015,2016,2017,2018,2019,2020,2021,2022,2023,2024,"Total fuel price for period",null,"PETROL",2014,2015,2016,2017,2018,2019,2020,2021,2022,2023,2024,"prezzo totale carburante per il periodo"]
["elettricità","$cents/kwh","prezzo previsto",10.217000000000001,10.143057000000001,10.121601999999999,10.095456,10.162350999999999,10.245552999999999,10.188694999999999,10.146483,10.065858,10.040848,10.164512,null,null,null,null,null,null,null,null,null,"prodotto 1",{"$f":"((LCC!$E$19*(LCC!$E$21/100))*LCC!$E$22)","v":0},{"$f":"((LCC!$E$19*(LCC!$E$21/100))*(LCC!$E$22*(1+$E$9)))","v":0},{"$f":"((LCC!$E$19*(LCC!$E$21/100))*(LCC!$E$22*(1+$F$9)))","v":0},{"$f":"((LCC!$E$19*(LCC!$E$21/100))*(LCC!$E$22*(1+G$9)))","v":0},{"$f":"((LCC!$E$19*(LCC!$E$21/100))*(LCC!$E$22*(1+H$9)))","v":0},{"$f":"((LCC!$E$19*(LCC!$E$21/100))*(LCC!$E$22*(1+I$9)))","v":0},{"$f":"((LCC!$E$19*(LCC!$E$21/100))*(LCC!$E$22*(1+J$9)))","v":0},{"$f":"((LCC!$E$19*(LCC!$E$21/100))*(LCC!$E$22*(1+K$9)))","v":0},{"$f":"((LCC!$E$19*(LCC!$E$21/100))*(LCC!$E$22*(1+L$9)))","v":0},{"$f":"((LCC!$E$19*(LCC!$E$21/100))*(LCC!$E$22*(1+M$9)))","v":0},{"$f":"((LCC!$E$19*(LCC!$E$21/100))*(LCC!$E$22*(1+N$9)))","v":0},{"$f":"SUM(Y16:INDEX(Y16:AI16,LCC!$E$6))","v":0},null,"prodotto 1",{"$f":"((LCC!$E$19*(LCC!$E$25/100))*LCC!$E$26)","v":0},{"$f":"((LCC!$E$19*(LCC!$E$25/100))*(LCC!$E$26*(1+$E$9)))","v":0},{"$f":"((LCC!$E$19*(LCC!$E$25/100))*(LCC!$E$26*(1+$F$9)))","v":0},{"$f":"((LCC!$E$19*(LCC!$E$25/100))*(LCC!$E$26*(1+$G$9)))","v":0},{"$f":"((LCC!$E$19*(LCC!$E$25/100))*(LCC!$E$26*(1+$H$9)))","v":0},{"$f":"((LCC!$E$19*(LCC!$E$25/100))*(LCC!$E$26*(1+$I$9)))","v":0},{"$f":"((LCC!$E$19*(LCC!$E$25/100))*(LCC!$E$26*(1+$J$9)))","v":0},{"$f":"((LCC!$E$19*(LCC!$E$25/100))*(LCC!$E$26*(1+$K$9)))","v":0},{"$f":"((LCC!$E$19*(LCC!$E$25/100))*(LCC!$E$26*(1+$L$9)))","v":0},{"$f":"((LCC!$E$19*(LCC!$E$25/100))*(LCC!$E$26*(1+$M$9)))","v":0},{"$f":"((LCC!$E$19*(LCC!$E$25/100))*(LCC!$E$26*(1+$N$9)))","v":0},{"$f":"SUM(AM16:INDEX(AM16:AW16,LCC!$E$6))","v":0}]
[null,null,"% rispetto anni prec",null,{"$f":"(E16-D16)/D16","v":-7.2372516394244753E-3},{"$f":"(F16-E16)/E16","v":-2.1152400109751262E-3},-2.5831879182760687E-3,6.6262484824854678E-3,8.1872787113926697E-3,-5.5495296349548024E-3,-4.1430232232880912E-3,-7.946103097989668E-3,-2.4846366797544707E-3,1.231609123054146E-2,null,null,null,null,null,null,null,null,null,"prodotto 2",{"$f":"((LCC!$G$19*(LCC!$G$21/100))*LCC!$G$22)","v":0},{"$f":"((LCC!$G$19*(LCC!$G$21/100))*(LCC!$G$22*(1+$E$9)))","v":0},{"$f":"((LCC!$G$19*(LCC!$G$21/100))*(LCC!$G$22*(1+$F$9)))","v":0},{"$f":"((LCC!$G$19*(LCC!$G$21/100))*(LCC!$G$22*(1+G$9)))","v":0},{"$f":"((LCC!$G$19*(LCC!$G$21/100))*(LCC!$G$22*(1+H$9)))","v":0},{"$f":"((LCC!$G$19*(LCC!$G$21/100))*(LCC!$G$22*(1+I$9)))","v":0},{"$f":"((LCC!$G$19*(LCC!$G$21/100))*(LCC!$G$22*(1+J$9)))","v":0},{"$f":"((LCC!$G$19*(LCC!$G$21/100))*(LCC!$G$22*(1+K$9)))","v":0},{"$f":"((LCC!$G$19*(LCC!$G$21/100))*(LCC!$G$22*(1+L$9)))","v":0},{"$f":"((LCC!$G$19*(LCC!$G$21/100))*(LCC!$G$22*(1+M$9)))","v":0},{"$f":"((LCC!$G$19*(LCC!$G$21/100))*(LCC!$G$22*(1+N$9)))","v":0},{"$f":"SUM(Y17:INDEX(Y17:AI17,LCC!$E$6))","v":0},null,"prodotto 2",{"$f":"((LCC!$G$19*(LCC!$G$25/100))*LCC!$G$26)","v":0},{"$f":"((LCC!$G$19*(LCC!$G$25/100))*(LCC!$G$26*(1+$E$9)))","v":0},{"$f":"((LCC!$G$19*(LCC!$G$25/100))*(LCC!$G$26*(1+$F$9)))","v":0},{"$f":"((LCC!$G$19*(LCC!$G$25/100))*(LCC!$G$26*(1+$G$9)))","v":0},{"$f":"((LCC!$G$19*(LCC!$G$25/100))*(LCC!$G$26*(1+$H$9)))","v":0},{"$f":"((LCC!$G$19*(LCC!$G$25/100))*(LCC!$G$26*(1+$I$9)))","v":0},{"$f":"((LCC!$G$19*(LCC!$G$25/100))*(LCC!$G$26*(1+$J$9)))","v":0},{"$f":"((LCC!$G$19*(LCC!$G$25/100))*(LCC!$G$26*(1+$K$9)))","v":0},{"$f":"((LCC!$G$19*(LCC!$G$25/100))*(LCC!$G$26*(1+$L$9)))","v":0},{"$f":"((LCC!$G$19*(LCC!$G$25/100))*(LCC!$G$26*(1+$M$9)))","v":0},{"$f":"((LCC!$G$19*(LCC!$G$25/100))*(LCC!$G$26*(1+$N$9)))","v":0},{"$f":"SUM(AM17:INDEX(AM17:AW17,LCC!$E$6))","v":0}]
[null,null,"% cumulativa",null,{"$f":"E17","v":-7.2372516394244753E-3},{"$f":"F17+E18","v":-9.3524916503996015E-3},{"$f":"G17+F18","v":-1.193567956867567E-2},-5.3094310861902024E-3,2.8778476252024673E-3,-2.6716820097523351E-3,-6.8147052330404263E-3,-1.4760808331030094E-2,-1.7245445010784566E-2,-4.9293537802431054E-3,null,null,null,null,null,null,null,null,null,"prodotto 3",{"$f":"((LCC!$I$19*(LCC!$I$21/100))*LCC!$I$22)","v":0},{"$f":"((LCC!$I$19*(LCC!$I$21/100))*(LCC!$I$22*(1+$E$9)))","v":0},{"$f":"((LCC!$I$19*(LCC!$I$21/100))*(LCC!$I$22*(1+$F$9)))","v":0},{"$f":"((LCC!$I$19*(LCC!$I$21/100))*(LCC!$I$22*(1+G$9)))","v":0},{"$f":"((LCC!$I$19*(LCC!$I$21/100))*(LCC!$I$22*(1+H$9)))","v":0},{"$f":"((LCC!$I$19*(LCC!$I$21/100))*(LCC!$I$22*(1+I$9)))","v":0},{"$f":"((LCC!$I$19*(LCC!$I$21/100))*(LCC!$I$22*(1+J$9)))","v":0},{"$f":"((LCC!$I$19*(LCC!$I$21/100))*(LCC!$I$22*(1+K$9)))","v":0},{"$f":"((LCC!$I$19*(LCC!$I$21/100))*(LCC!$I$22*(1+L$9)))","v":0},{"$f":"((LCC!$I$19*(LCC!$I$21/100))*(LCC!$I$22*(1+M$9)))","v":0},{"$f":"((LCC!$I$19*(LCC!$I$21/100))*(LCC!$I$22*(1+N$9)))","v":0},{"$f":"SUM(Y18:INDEX(Y18:AI18,LCC!$E$6))","v":0},null,"prodotto 3",{"$f":"((LCC!$I$19*(LCC!$I$25/100))*LCC!$I$26)","v":0},{"$f":"((LCC!$I$19*(LCC!$I$25/100))*(LCC!$I$26*(1+$E$9)))","v":0},{"$f":"((LCC!$I$19*(LCC!$I$25/100))*(LCC!$I$26*(1+$F$9)))","v":0},{"$f":"((LCC!$I$19*(LCC!$I$25/100))*(LCC!$I$26*(1+$G$9)))","v":0},{"$f":"((LCC!$I$19*(LCC!$I$25/100))*(LCC!$I$26*(1+$H$9)))","v":0},{"$f":"((LCC!$I$19*(LCC!$I$25/100))*(LCC!$I$26*(1+$I$9)))","v":0},{"$f":"((LCC!$I$19*(LCC!$I$25/100))*(LCC!$I$26*(1+$J$9)))","v":0},{"$f":"((LCC!$I$19*(LCC!$I$25/100))*(LCC!$I$26*(1+$K$9)))","v":0},{"$f":"((LCC!$I$19*(LCC!$I$25/100))*(LCC!$I$26*(1+$L$9)))","v":0},{"$f":"((LCC!$I$19*(LCC!$I$25/100))*(LCC!$I$26*(1+$M$9)))","v":0},{"$f":"((LCC!$I$19*(LCC!$I$25/100))*(LCC!$I$26*(1+$N$9)))","v":0},{"$f":"SUM(AM18:INDEX(AM18:AW18,LCC!$E$6))","v":0}]
["Biodiesel","$/100 litro","prezzo previsto",156.19999999999999,153.5,148.80000000000001,154.69999999999999,159.80000000000001,159.80000000000001,164.3,167,173,175,177.6,null,null,null,null,null,null,null,null,null,"prodotto 4",{"$f":"((LCC!$K$19*(LCC!$K$21/100))*LCC!$K$22)","v":0},{"$f":"((LCC!$K$19*(LCC!$K$21/100))*(LCC!$K$22*(1+$E$9)))","v":0},{"$f":"((LCC!$K$19*(LCC!$K$21/100))*(LCC!$K$22*(1+$F$9)))","v":0},{"$f":"((LCC!$K$19*(LCC!$K$21/100))*(LCC!$K$22*(1+G$9)))","v":0},{"$f":"((LCC!$K$19*(LCC!$K$21/100))*(LCC!$K$22*(1+H$9)))","v":0},{"$f":"((LCC!$K$19*(LCC!$K$21/100))*(LCC!$K$22*(1+I$9)))","v":0},{"$f":"((LCC!$K$19*(LCC!$K$21/100))*(LCC!$K$22*(1+J$9)))","v":0},{"$f":"((LCC!$K$19*(LCC!$K$21/100))*(LCC!$K$22*(1+K$9)))","v":0},{"$f":"((LCC!$K$19*(LCC!$K$21/100))*(LCC!$K$22*(1+L$9)))","v":0},{"$f":"((LCC!$K$19*(LCC!$K$21/100))*(LCC!$K$22*(1+M$9)))","v":0},{"$f":"((LCC!$K$19*(LCC!$K$21/100))*(LCC!$K$22*(1+N$9)))","v":0},{"$f":"SUM(Y19:INDEX(Y19:AI19,LCC!$E$6))","v":0},null,"prodotto 4",{"$f":"((LCC!$K$19*(LCC!$K$25/100))*LCC!$K$26)","v":0},{"$f":"((LCC!$K$19*(LCC!$K$25/100))*(LCC!$K$26*(1+$E$9)))","v":0},{"$f":"((LCC!$K$19*(LCC!$K$25/100))*(LCC!$K$26*(1+$F$9)))","v":0},{"$f":"((LCC!$K$19*(LCC!$K$25/100))*(LCC!$K$26*(1+$G$9)))","v":0},{"$f":"((LCC!$K$19*(LCC!$K$25/100))*(LCC!$K$26*(1+$H$9)))","v":0},{"$f":"((LCC!$K$19*(LCC!$K$25/100))*(LCC!$K$26*(1+$I$9)))","v":0},{"$f":"((LCC!$K$19*(LCC!$K$25/100))*(LCC!$K$26*(1+$J$9)))","v":0},{"$f":"((LCC!$K$19*(LCC!$K$25/100))*(LCC!$K$26*(1+$K$9)))","v":0},{"$f":"((LCC!$K$19*(LCC!$K$25/100))*(LCC!$K$26*(1+$L$9)))","v":0},{"$f":"((LCC!$K$19*(LCC!$K$25/100))*(LCC!$K$26*(1+$M$9)))","v":0},{"$f":"((LCC!$K$19*(LCC!$K$25/100))*(LCC!$K$26*(1+$N$9)))","v":0},{"$f":"SUM(AM19:INDEX(AM19:AW19,LCC!$E$6))","v":0}]
[null,null,"% rispetto anni prec",null,{"$f":"(E19-D19)/D19","v":-1.728553137003834E-2},{"$f":"(F19-E19)/E19","v":-3.0618892508143248E-2},3.9650537634408449E-2,3.2967032967033114E-2,0,2.8160200250312888E-2,1.6433353621424153E-2,3.5928143712574849E-2,1.1560693641618497E-2,1.4857142857142824E-2,null,null,null,null,null,null,null,null,null,"prodotto 5",{"$f":"((LCC!$M$19*(LCC!$M$21/100))*LCC!$M$22)","v":0},{"$f":"((LCC!$M$19*(LCC!$M$21/100))*(LCC!$M$22*(1+$E$9)))","v":0},{"$f":"((LCC!$M$19*(LCC!$M$21/100))*(LCC!$M$22*(1+$F$9)))","v":0},{"$f":"((LCC!$M$19*(LCC!$M$21/100))*(LCC!$M$22*(1+G$9)))","v":0},{"$f":"((LCC!$M$19*(LCC!$M$21/100))*(LCC!$M$22*(1+H$9)))","v":0},{"$f":"((LCC!$M$19*(LCC!$M$21/100))*(LCC!$M$22*(1+I$9)))","v":0},{"$f":"((LCC!$M$19*(LCC!$M$21/100))*(LCC!$M$22*(1+J$9)))","v":0},{"$f":"((LCC!$M$19*(LCC!$M$21/100))*(LCC!$M$22*(1+K$9)))","v":0},{"$f":"((LCC!$M$19*(LCC!$M$21/100))*(LCC!$M$22*(1+L$9)))","v":0},{"$f":"((LCC!$M$19*(LCC!$M$21/100))*(LCC!$M$22*(1+M$9)))","v":0},{"$f":"((LCC!$M$19*(LCC!$M$21/100))*(LCC!$M$22*(1+N$9)))","v":0},{"$f":"SUM(Y20:INDEX(Y20:AI20,LCC!$E$6))","v":0},null,"prodotto 5",{"$f":"((LCC!$M$19*(LCC!$M$25/100))*LCC!$M$26)","v":0},{"$f":"((LCC!$M$19*(LCC!$M$25/100))*(LCC!$M$26*(1+$E$9)))","v":0},{"$f":"((LCC!$M$19*(LCC!$M$25/100))*(LCC!$M$26*(1+$F$9)))","v":0},{"$f":"((LCC!$M$19*(LCC!$M$25/100))*(LCC!$M$26*(1+$G$9)))","v":0},{"$f":"((LCC!$M$19*(LCC!$M$25/100))*(LCC!$M$26*(1+$H$9)))","v":0},{"$f":"((LCC!$M$19*(LCC!$M$25/100))*(LCC!$M$26*(1+$I$9)))","v":0},{"$f":"((LCC!$M$19*(LCC!$M$25/100))*(LCC!$M$26*(1+$J$9)))","v":0},{"$f":"((LCC!$M$19*(LCC!$M$25/100))*(LCC!$M$26*(1+$K$9)))","v":0},{"$f":"((LCC!$M$19*(LCC!$M$25/100))*(LCC!$M$26*(1+$L$9)))","v":0},{"$f":"((LCC!$M$19*(LCC!$M$25/100))*(LCC!$M$26*(1+$M$9)))","v":0},{"$f":"((LCC!$M$19*(LCC!$M$25/100))*(LCC!$M$26*(1+$N$9)))","v":0},{"$f":"SUM(AM20:INDEX(AM20:AW20,LCC!$E$6))","v":0}]
[null,null,"% cumulativa",null,{"$f":"E20","v":-1.728553137003834E-2},{"$f":"F20+E21","v":-4.7904423878181585E-2},{"$f":"G20+F21","v":-8.2538862437731356E-3},2.4713146723259978E-2,2.4713146723259978E-2,5.2873346973572863E-2,6.9306700594997023E-2,0.10523484430757188,0.11679553794919037,0.13165268080633319,null,null,null,null,null,null,null,null,null,"prodotto 6",{"$f":"((LCC!$O$19*(LCC!$O$21/100))*LCC!$O$22)","v":0},{"$f":"((LCC!$O$19*(LCC!$O$21/100))*(LCC!$O$22*(1+$E$9)))","v":0},{"$f":"((LCC!$O$19*(LCC!$O$21/100))*(LCC!$O$22*(1+$F$9)))","v":0},{"$f":"((LCC!$O$19*(LCC!$O$21/100))*(LCC!$O$22*(1+G$9)))","v":0},{"$f":"((LCC!$O$19*(LCC!$O$21/100))*(LCC!$O$22*(1+H$9)))","v":0},{"$f":"((LCC!$O$19*(LCC!$O$21/100))*(LCC!$O$22*(1+I$9)))","v":0},{"$f":"((LCC!$O$19*(LCC!$O$21/100))*(LCC!$O$22*(1+J$9)))","v":0},{"$f":"((LCC!$O$19*(LCC!$O$21/100))*(LCC!$O$22*(1+K$9)))","v":0},{"$f":"((LCC!$O$19*(LCC!$O$21/100))*(LCC!$O$22*(1+L$9)))","v":0},{"$f":"((LCC!$O$19*(LCC!$O$21/100))*(LCC!$O$22*(1+M$9)))","v":0},{"$f":"((LCC!$O$19*(LCC!$O$21/100))*(LCC!$O$22*(1+N$9)))","v":0},{"$f":"SUM(Y21:INDEX(Y21:AI21,LCC!$E$6))","v":0},null,"prodotto 6",{"$f":"((LCC!$O$19*(LCC!$O$25/100))*LCC!$O$26)","v":0},{"$f":"((LCC!$O$19*(LCC!$O$25/100))*(LCC!$O$26*(1+$E$9)))","v":0},{"$f":"((LCC!$O$19*(LCC!$O$25/100))*(LCC!$O$26*(1+$F$9)))","v":0},{"$f":"((LCC!$O$19*(LCC!$O$25/100))*(LCC!$O$26*(1+$G$9)))","v":0},{"$f":"((LCC!$O$19*(LCC!$O$25/100))*(LCC!$O$26*(1+$H$9)))","v":0},{"$f":"((LCC!$O$19*(LCC!$O$25/100))*(LCC!$O$26*(1+$I$9)))","v":0},{"$f":"((LCC!$O$19*(LCC!$O$25/100))*(LCC!$O$26*(1+$J$9)))","v":0},{"$f":"((LCC!$O$19*(LCC!$O$25/100))*(LCC!$O$26*(1+$K$9)))","v":0},{"$f":"((LCC!$O$19*(LCC!$O$25/100))*(LCC!$O$26*(1+$L$9)))","v":0},{"$f":"((LCC!$O$19*(LCC!$O$25/100))*(LCC!$O$26*(1+$M$9)))","v":0},{"$f":"((LCC!$O$19*(LCC!$O$25/100))*(LCC!$O$26*(1+$N$9)))","v":0},{"$f":"SUM(AM21:INDEX(AM21:AW21,LCC!$E$6))","v":0}]
["Natural Gas","$/millioni  Btu","prezzo previsto",16.09,16.100000000000001,16.52,16.73,17.02,17.170000000000002,17.260000000000002,17.41,17.7,17.96,18.170000000000002,null,null,null,null,null,null,null,null,null,"prodotto 7",{"$f":"((LCC!$Q$19*(LCC!$Q$21/100))*LCC!$Q$22)","v":0},{"$f":"((LCC!$Q$19*(LCC!$Q$21/100))*(LCC!$Q$22*(1+$E$9)))","v":0},{"$f":"((LCC!$Q$19*(LCC!$Q$21/100))*(LCC!$Q$22*(1+$F$9)))","v":0},{"$f":"((LCC!$Q$19*(LCC!$Q$21/100))*(LCC!$Q$22*(1+G$9)))","v":0},{"$f":"((LCC!$Q$19*(LCC!$Q$21/100))*(LCC!$Q$22*(1+H$9)))","v":0},{"$f":"((LCC!$Q$19*(LCC!$Q$21/100))*(LCC!$Q$22*(1+I$9)))","v":0},{"$f":"((LCC!$Q$19*(LCC!$Q$21/100))*(LCC!$Q$22*(1+J$9)))","v":0},{"$f":"((LCC!$Q$19*(LCC!$Q$21/100))*(LCC!$Q$22*(1+K$9)))","v":0},{"$f":"((LCC!$Q$19*(LCC!$Q$21/100))*(LCC!$Q$22*(1+L$9)))","v":0},{"$f":"((LCC!$Q$19*(LCC!$Q$21/100))*(LCC!$Q$22*(1+M$9)))","v":0},{"$f":"((LCC!$Q$19*(LCC!$Q$21/100))*(LCC!$Q$22*(1+N$9)))","v":0},{"$f":"SUM(Y22:INDEX(Y22:AI22,LCC!$E$6))","v":0},null,"prodotto 7",{"$f":"((LCC!$Q$19*(LCC!$Q$25/100))*LCC!$Q$26)","v":0},{"$f":"((LCC!$Q$19*(LCC!$Q$25/100))*(LCC!$Q$26*(1+$E$9)))","v":0},{"$f":"((LCC!$Q$19*(LCC!$Q$25/100))*(LCC!$Q$26*(1+$F$9)))","v":0},{"$f":"((LCC!$Q$19*(LCC!$Q$25/100))*(LCC!$Q$26*(1+$G$9)))","v":0},{"$f":"((LCC!$Q$19*(LCC!$Q$25/100))*(LCC!$Q$26*(1+$H$9)))","v":0},{"$f":"((LCC!$Q$19*(LCC!$Q$25/100))*(LCC!$Q$26*(1+$I$9)))","v":0},{"$f":"((LCC!$Q$19*(LCC!$Q$25/100))*(LCC!$Q$26*(1+$J$9)))","v":0},{"$f":"((LCC!$Q$19*(LCC!$Q$25/100))*(LCC!$Q$26*(1+$K$9)))","v":0},{"$f":"((LCC!$Q$19*(LCC!$Q$25/100))*(LCC!$Q$26*(1+$L$9)))","v":0},{"$f":"((LCC!$Q$19*(LCC!$Q$25/100))*(LCC!$Q$26*(1+$M$9)))","v":0},{"$f":"((LCC!$Q$19*(LCC!$Q$25/100))*(LCC!$Q$26*(1+$N$9)))","v":0},{"$f":"SUM(AM22:INDEX(AM22:AW22,LCC!$E$6))","v":0}]
[null,null,"% rispetto anni prec",null,{"$f":"(E22-D22)/D22","v":6.2150403977635576E-4},{"$f":"(F22-E22)/E22","v":2.6086956521739015E-2},1.2711864406779712E-2,1.7334130304841551E-2,8.8131609870741555E-3,5.2417006406522918E-3,8.6906141367322463E-3,1.6657093624353771E-2,1.4689265536723253E-2,1.1692650334075771E-2,null,null,null,null,null,null,null,null,null,"prodotto 8",{"$f":"((LCC!$S$19*(LCC!$S$21/100))*LCC!$S$22)","v":0},{"$f":"((LCC!$S$19*(LCC!$S$21/100))*(LCC!$S$22*(1+$E$9)))","v":0},{"$f":"((LCC!$S$19*(LCC!$S$21/100))*(LCC!$S$22*(1+$F$9)))","v":0},{"$f":"((LCC!$S$19*(LCC!$S$21/100))*(LCC!$S$22*(1+G$9)))","v":0},{"$f":"((LCC!$S$19*(LCC!$S$21/100))*(LCC!$S$22*(1+H$9)))","v":0},{"$f":"((LCC!$S$19*(LCC!$S$21/100))*(LCC!$S$22*(1+I$9)))","v":0},{"$f":"((LCC!$S$19*(LCC!$S$21/100))*(LCC!$S$22*(1+J$9)))","v":0},{"$f":"((LCC!$S$19*(LCC!$S$21/100))*(LCC!$S$22*(1+K$9)))","v":0},{"$f":"((LCC!$S$19*(LCC!$S$21/100))*(LCC!$S$22*(1+L$9)))","v":0},{"$f":"((LCC!$S$19*(LCC!$S$21/100))*(LCC!$S$22*(1+M$9)))","v":0},{"$f":"((LCC!$S$19*(LCC!$S$21/100))*(LCC!$S$22*(1+N$9)))","v":0},{"$f":"SUM(Y23:INDEX(Y23:AI23,LCC!$E$6))","v":0},null,"prodotto 8",{"$f":"((LCC!$S$19*(LCC!$S$25/100))*LCC!$S$26)","v":0},{"$f":"((LCC!$S$19*(LCC!$S$25/100))*(LCC!$S$26*(1+$E$9)))","v":0},{"$f":"((LCC!$S$19*(LCC!$S$25/100))*(LCC!$S$26*(1+$F$9)))","v":0},{"$f":"((LCC!$S$19*(LCC!$S$25/100))*(LCC!$S$26*(1+$G$9)))","v":0},{"$f":"((LCC!$S$19*(LCC!$S$25/100))*(LCC!$S$26*(1+$H$9)))","v":0},{"$f":"((LCC!$S$19*(LCC!$S$25/100))*(LCC!$S$26*(1+$I$9)))","v":0},{"$f":"((LCC!$S$19*(LCC!$S$25/100))*(LCC!$S$26*(1+$J$9)))","v":0},{"$f":"((LCC!$S$19*(LCC!$S$25/100))*(LCC!$S$26*(1+$K$9)))","v":0},{"$f":"((LCC!$S$19*(LCC!$S$25/100))*(LCC!$S$26*(1+$L$9)))","v":0},{"$f":"((LCC!$S$19*(LCC!$S$25/100))*(LCC!$S$26*(1+$M$9)))","v":0},{"$f":"((LCC!$S$19*(LCC!$S$25/100))*(LCC!$S$26*(1+$N$9)))","v":0},{"$f":"SUM(AM23:INDEX(AM23:AW23,LCC!$E$6))","v":0}]
[null,null,"% cumulativa",null,{"$f":"E23","v":6.2150403977635576E-4},{"$f":"F23+E24","v":2.6708460561515369E-2},{"$f":"G23+F24","v":3.9420324968295083E-2},5.6754455273136634E-2,6.5567616260210793E-2,7.080931690086309E-2,7.9499931037595339E-2,9.6157024661949114E-2,0.11084629019867237,0.12253894053274814,null,null,null,null,null,null,null,null,null,"prodotto 9",{"$f":"((LCC!$U$19*(LCC!$U$21/100))*LCC!$U$22)","v":0},{"$f":"((LCC!$U$19*(LCC!$U$21/100))*(LCC!$U$22*(1+$E$9)))","v":0},{"$f":"((LCC!$U$19*(LCC!$U$21/100))*(LCC!$U$22*(1+$F$9)))","v":0},{"$f":"((LCC!$U$19*(LCC!$U$21/100))*(LCC!$U$22*(1+G$9)))","v":0},{"$f":"((LCC!$U$19*(LCC!$U$21/100))*(LCC!$U$22*(1+H$9)))","v":0},{"$f":"((LCC!$U$19*(LCC!$U$21/100))*(LCC!$U$22*(1+I$9)))","v":0},{"$f":"((LCC!$U$19*(LCC!$U$21/100))*(LCC!$U$22*(1+J$9)))","v":0},{"$f":"((LCC!$U$19*(LCC!$U$21/100))*(LCC!$U$22*(1+K$9)))","v":0},{"$f":"((LCC!$U$19*(LCC!$U$21/100))*(LCC!$U$22*(1+L$9)))","v":0},{"$f":"((LCC!$U$19*(LCC!$U$21/100))*(LCC!$U$22*(1+M$9)))","v":0},{"$f":"((LCC!$U$19*(LCC!$U$21/100))*(LCC!$U$22*(1+N$9)))","v":0},{"$f":"SUM(Y24:INDEX(Y24:AI24,LCC!$E$6))","v":0},null,"prodotto 9",{"$f":"((LCC!$U$19*(LCC!$U$25/100))*LCC!$U$26)","v":0},{"$f":"((LCC!$U$19*(LCC!$U$25/100))*(LCC!$U$26*(1+$E$9)))","v":0},{"$f":"((LCC!$U$19*(LCC!$U$25/100))*(LCC!$U$26*(1+$F$9)))","v":0},{"$f":"((LCC!$U$19*(LCC!$U$25/100))*(LCC!$U$26*(1+$G$9)))","v":0},{"$f":"((LCC!$U$19*(LCC!$U$25/100))*(LCC!$U$26*(1+$H$9)))","v":0},{"$f":"((LCC!$U$19*(LCC!$U$25/100))*(LCC!$U$26*(1+$I$9)))","v":0},{"$f":"((LCC!$U$19*(LCC!$U$25/100))*(LCC!$U$26*(1+$J$9)))","v":0},{"$f":"((LCC!$U$19*(LCC!$U$25/100))*(LCC!$U$26*(1+$K$9)))","v":0},{"$f":"((LCC!$U$19*(LCC!$U$25/100))*(LCC!$U$26*(1+$L$9)))","v":0},{"$f":"((LCC!$U$19*(LCC!$U$25/100))*(LCC!$U$26*(1+$M$9)))","v":0},{"$f":"((LCC!$U$19*(LCC!$U$25/100))*(LCC!$U$26*(1+$N$9)))","v":0},{"$f":"SUM(AM24:INDEX(AM24:AW24,LCC!$E$6))","v":0}]
[null,null,null,null,null,null,null,null,null,null,null,null,null,null,null,null,null,null,null,null,null,null,null,"prodotto 10",{"$f":"((LCC!$W$19*(LCC!$W$21/100))*LCC!$W$22)","v":0},{"$f":"((LCC!$W$19*(LCC!$W$21/100))*(LCC!$W$22*(1+$E$9)))","v":0},{"$f":"((LCC!$W$19*(LCC!$W$21/100))*(LCC!$W$22*(1+$F$9)))","v":0},{"$f":"((LCC!$W$19*(LCC!$W$21/100))*(LCC!$W$22*(1+G$9)))","v":0},{"$f":"((LCC!$W$19*(LCC!$W$21/100))*(LCC!$W$22*(1+H$9)))","v":0},{"$f":"((LCC!$W$19*(LCC!$W$21/100))*(LCC!$W$22*(1+I$9)))","v":0},{"$f":"((LCC!$W$19*(LCC!$W$21/100))*(LCC!$W$22*(1+J$9)))","v":0},{"$f":"((LCC!$W$19*(LCC!$W$21/100))*(LCC!$W$22*(1+K$9)))","v":0},{"$f":"((LCC!$W$19*(LCC!$W$21/100))*(LCC!$W$22*(1+L$9)))","v":0},{"$f":"((LCC!$W$19*(LCC!$W$21/100))*(LCC!$W$22*(1+M$9)))","v":0},{"$f":"((LCC!$W$19*(LCC!$W$21/100))*(LCC!$W$22*(1+N$9)))","v":0},{"$f":"SUM(Y25:INDEX(Y25:AI25,LCC!$E$6))","v":0},null,"prodotto 10",{"$f":"((LCC!$W$19*(LCC!$W$25/100))*LCC!$W$26)","v":0},{"$f":"((LCC!$W$19*(LCC!$W$25/100))*(LCC!$W$26*(1+$E$9)))","v":0},{"$f":"((LCC!$W$19*(LCC!$W$25/100))*(LCC!$W$26*(1+$F$9)))","v":0},{"$f":"((LCC!$W$19*(LCC!$W$25/100))*(LCC!$W$26*(1+$G$9)))","v":0},{"$f":"((LCC!$W$19*(LCC!$W$25/100))*(LCC!$W$26*(1+$H$9)))","v":0},{"$f":"((LCC!$W$19*(LCC!$W$25/100))*(LCC!$W$26*(1+$I$9)))","v":0},{"$f":"((LCC!$W$19*(LCC!$W$25/100))*(LCC!$W$26*(1+$J$9)))","v":0},{"$f":"((LCC!$W$19*(LCC!$W$25/100))*(LCC!$W$26*(1+$K$9)))","v":0},{"$f":"((LCC!$W$19*(LCC!$W$25/100))*(LCC!$W$26*(1+$L$9)))","v":0},{"$f":"((LCC!$W$19*(LCC!$W$25/100))*(LCC!$W$26*(1+$M$9)))","v":0},{"$f":"((LCC!$W$19*(LCC!$W$25/100))*(LCC!$W$26*(1+$N$9)))","v":0},{"$f":"SUM(AM25:INDEX(AM25:AW25,LCC!$E$6))","v":0}]
[]
[null,null,null,2014,"2017 (3 anni)","2019 (5anni)","2024 (10anni)","prodotto 1","prodotto 2","prodotto 3","prodotto 4","prodotto 5","prodotto 6","prodotto 7","prodotto 8","prodotto 9","prodotto 10",null,null,null,null,null,null,"LPG",2014,2015,2016,2017,2018,2019,2020,2021,2022,2023,2024,"Total fuel price for period",null,"LPG",2014,2015,2016,2017,2018,2019,2020,2021,2022,2023,2024,"prezzo totale carburante per il periodo"]
[null,"Diesel ","prezzo previsto ($/gallone)",3.68,3.5,3.61,3.92,{"$f":"$AJ4","v":0},{"$f":"$AJ5","v":0},{"$f":"$AJ6","v":0},{"$f":"AJ7","v":0},{"$f":"AJ8","v":0},{"$f":"AJ9","v":0},{"$f":"AJ10","v":0},{"$f":"AJ11","v":0},{"$f":"AJ12","v":0},{"$f":"AJ13","v":0},null,null,null,null,null,null,"prodotto 1",{"$f":"((LCC!$E$19*(LCC!$E$21/100))*LCC!$E$22)","v":0},{"$f":"((LCC!$E$19*(LCC!$E$21/100))*(LCC!$E$22*(1+$E$12)))","v":0},{"$f":"((LCC!$E$19*(LCC!$E$21/100))*(LCC!$E$22*(1+$F$12)))","v":0},{"$f":"((LCC!$E$19*(LCC!$E$21/100))*(LCC!$E$22*(1+G$12)))","v":0},{"$f":"((LCC!$E$19*(LCC!$E$21/100))*(LCC!$E$22*(1+H$12)))","v":0},{"$f":"((LCC!$E$19*(LCC!$E$21/100))*(LCC!$E$22*(1+I$12)))","v":0},{"$f":"((LCC!$E$19*(LCC!$E$21/100))*(LCC!$E$22*(1+J$12)))","v":0},{"$f":"((LCC!$E$19*(LCC!$E$21/100))*(LCC!$E$22*(1+K$12)))","v":0},{"$f":"((LCC!$E$19*(LCC!$E$21/100))*(LCC!$E$22*(1+L$12)))","v":0},{"$f":"((LCC!$E$19*(LCC!$E$21/100))*(LCC!$E$22*(1+M$12)))","v":0},{"$f":"((LCC!$E$19*(LCC!$E$21/100))*(LCC!$E$22*(1+N$12)))","v":0},{"$f":"SUM(Y28:INDEX(Y28:AI28,LCC!$E$6))","v":0},null,"prodotto 1",{"$f":"((LCC!$E$19*(LCC!$E$25/100))*LCC!$E$26)","v":0},{"$f":"((LCC!$E$19*(LCC!$E$25/100))*(LCC!$E$26*(1+$E$12)))","v":0},{"$f":"((LCC!$E$19*(LCC!$E$25/100))*(LCC!$E$26*(1+$F$12)))","v":0},{"$f":"((LCC!$E$19*(LCC!$E$25/100))*(LCC!$E$26*(1+$G$12)))","v":0},{"$f":"((LCC!$E$19*(LCC!$E$25/100))*(LCC!$E$26*(1+$H$12)))","v":0},{"$f":"((LCC!$E$19*(LCC!$E$25/100))*(LCC!$E$26*(1+$I$12)))","v":0},{"$f":"((LCC!$E$19*(LCC!$E$25/100))*(LCC!$E$26*(1+$J$12)))","v":0},{"$f":"((LCC!$E$19*(LCC!$E$25/100))*(LCC!$E$26*(1+$K$12)))","v":0},{"$f":"((LCC!$E$19*(LCC!$E$25/100))*(LCC!$E$26*(1+$L$12)))","v":0},{"$f":"((LCC!$E$19*(LCC!$E$25/100))*(LCC!$E$26*(1+$M$12)))","v":0},{"$f":"((LCC!$E$19*(LCC!$E$25/100))*(LCC!$E$26*(1+$N$12)))","v":0},{"$f":"SUM(AM28:INDEX(AM28:AW28,LCC!$E$6))","v":0}]
[null,null,"% crescita/decrescita",null,-5.0999999999999997E-2,-1.8800000000000001E-2,6.3600000000000004E-2,{"$f":"AX4","v":0},{"$f":"AX5","v":0},{"$f":"AX6","v":0},{"$f":"AX7","v":0},{"$f":"AX8","v":0},{"$f":"AX9","v":0},{"$f":"AX10","v":0},{"$f":"AX11","v":0},{"$f":"AX12","v":0},{"$f":"AX13","v":0},null,null,null,null,null,null,"prodotto 2",{"$f":"((LCC!$G$19*(LCC!$G$21/100))*LCC!$G$22)","v":0},{"$f":"((LCC!$G$19*(LCC!$G$21/100))*(LCC!$G$22*(1+$E$12)))","v":0},{"$f":"((LCC!$G$19*(LCC!$G$21/100))*(LCC!$G$22*(1+$F$12)))","v":0},{"$f":"((LCC!$G$19*(LCC!$G$21/100))*(LCC!$G$22*(1+G$12)))","v":0},{"$f":"((LCC!$G$19*(LCC!$G$21/100))*(LCC!$G$22*(1+H$12)))","v":0},{"$f":"((LCC!$G$19*(LCC!$G$21/100))*(LCC!$G$22*(1+I$12)))","v":0},{"$f":"((LCC!$G$19*(LCC!$G$21/100))*(LCC!$G$22*(1+J$12)))","v":0},{"$f":"((LCC!$G$19*(LCC!$G$21/100))*(LCC!$G$22*(1+K$12)))","v":0},{"$f":"((LCC!$G$19*(LCC!$G$21/100))*(LCC!$G$22*(1+L$12)))","v":0},{"$f":"((LCC!$G$19*(LCC!$G$21/100))*(LCC!$G$22*(1+M$12)))","v":0},{"$f":"((LCC!$G$19*(LCC!$G$21/100))*(LCC!$G$22*(1+N$12)))","v":0},{"$f":"SUM(Y29:INDEX(Y29:AI29,LCC!$E$6))","v":0},null,"prodotto 2",{"$f":"((LCC!$G$19*(LCC!$G$25/100))*LCC!$G$26)","v":0},{"$f":"((LCC!$G$19*(LCC!$G$25/100))*(LCC!$G$26*(1+$E$12)))","v":0},{"$f":"((LCC!$G$19*(LCC!$G$25/100))*(LCC!$G$26*(1+$F$12)))","v":0},{"$f":"((LCC!$G$19*(LCC!$G$25/100))*(LCC!$G$26*(1+$G$12)))","v":0},{"$f":"((LCC!$G$19*(LCC!$G$25/100))*(LCC!$G$26*(1+$H$12)))","v":0},{"$f":"((LCC!$G$19*(LCC!$G$25/100))*(LCC!$G$26*(1+$I$12)))","v":0},{"$f":"((LCC!$G$19*(LCC!$G$25/100))*(LCC!$G$26*(1+$J$12)))","v":0},{"$f":"((LCC!$G$19*(LCC!$G$25/100))*(LCC!$G$26*(1+$K$12)))","v":0},{"$f":"((LCC!$G$19*(LCC!$G$25/100))*(LCC!$G$26*(1+$L$12)))","v":0},{"$f":"((LCC!$G$19*(LCC!$G$25/100))*(LCC!$G$26*(1+$M$12)))","v":0},{"$f":"((LCC!$G$19*(LCC!$G$25/100))*(LCC!$G$26*(1+$N$12)))","v":0},{"$f":"SUM(AM29:INDEX(AM29:AW29,LCC!$E$6))","v":0}]
[null,"benzina","prezzo previsto ($/gallone)",3.3809999999999998,3.02,3.03,3.26,{"$f":"AJ16","v":0},{"$f":"AJ17","v":0},{"$f":"AJ18","v":0},{"$f":"AJ19","v":0},{"$f":"$AJ20","v":0},{"$f":"$AJ21","v":0},{"$f":"$AJ22","v":0},{"$f":"$AJ23","v":0},{"$f":"$AJ24","v":0},{"$f":"$AJ25","v":0},null,null,null,null,null,null,"prodotto 3",{"$f":"((LCC!$I$19*(LCC!$I$21/100))*LCC!$I$22)","v":0},{"$f":"((LCC!$I$19*(LCC!$I$21/100))*(LCC!$I$22*(1+$E$12)))","v":0},{"$f":"((LCC!$I$19*(LCC!$I$21/100))*(LCC!$I$22*(1+$F$12)))","v":0},{"$f":"((LCC!$I$19*(LCC!$I$21/100))*(LCC!$I$22*(1+G$12)))","v":0},{"$f":"((LCC!$I$19*(LCC!$I$21/100))*(LCC!$I$22*(1+H$12)))","v":0},{"$f":"((LCC!$I$19*(LCC!$I$21/100))*(LCC!$I$22*(1+I$12)))","v":0},{"$f":"((LCC!$I$19*(LCC!$I$21/100))*(LCC!$I$22*(1+J$12)))","v":0},{"$f":"((LCC!$I$19*(LCC!$I$21/100))*(LCC!$I$22*(1+K$12)))","v":0},{"$f":"((LCC!$I$19*(LCC!$I$21/100))*(LCC!$I$22*(1+L$12)))","v":0},{"$f":"((LCC!$I$19*(LCC!$I$21/100))*(LCC!$I$22*(1+M$12)))","v":0},{"$f":"((LCC!$I$19*(LCC!$I$21/100))*(LCC!$I$22*(1+N$12)))","v":0},{"$f":"SUM(Y30:INDEX(Y30:AI30,LCC!$E$6))","v":0},null,"prodotto 3",{"$f":"((LCC!$I$19*(LCC!$I$25/100))*LCC!$I$26)","v":0},{"$f":"((LCC!$I$19*(LCC!$I$25/100))*(LCC!$I$26*(1+$E$12)))","v":0},{"$f":"((LCC!$I$19*(LCC!$I$25/100))*(LCC!$I$26*(1+$F$12)))","v":0},{"$f":"((LCC!$I$19*(LCC!$I$25/100))*(LCC!$I$26*(1+$G$12)))","v":0},{"$f":"((LCC!$I$19*(LCC!$I$25/100))*(LCC!$I$26*(1+$H$12)))","v":0},{"$f":"((LCC!$I$19*(LCC!$I$25/100))*(LCC!$I$26*(1+$I$12)))","v":0},{"$f":"((LCC!$I$19*(LCC!$I$25/100))*(LCC!$I$26*(1+$J$12)))","v":0},{"$f":"((LCC!$I$19*(LCC!$I$25/100))*(LCC!$I$26*(1+$K$12)))","v":0},{"$f":"((LCC!$I$19*(LCC!$I$25/100))*(LCC!$I$26*(1+$L$12)))","v":0},{"$f":"((LCC!$I$19*(LCC!$I$25/100))*(LCC!$I$26*(1+$M$12)))","v":0},{"$f":"((LCC!$I$19*(LCC!$I$25/100))*(LCC!$I$26*(1+$N$12)))","v":0},{"$f":"SUM(AM30:INDEX(AM30:AW30,LCC!$E$6))","v":0}]
[null,null,"% crescita/decrescita",null,-0.1079,-0.10539999999999999,-3.2800000000000003E-2,{"$f":"AX16","v":0},{"$f":"AX17","v":0},{"$f":"AX18","v":0},{"$f":"AX19","v":0},{"$f":"$AX20","v":0},{"$f":"$AX21","v":0},{"$f":"$AX22","v":0},{"$f":"$AX23","v":0},{"$f":"$AX24","v":0},{"$f":"$AX25","v":0},null,null,null,null,null,null,"prodotto 4",{"$f":"((LCC!$K$19*(LCC!$K$21/100))*LCC!$K$22)","v":0},{"$f":"((LCC!$K$19*(LCC!$K$21/100))*(LCC!$K$22*(1+$E$12)))","v":0},{"$f":"((LCC!$K$19*(LCC!$K$21/100))*(LCC!$K$22*(1+$F$12)))","v":0},{"$f":"((LCC!$K$19*(LCC!$K$21/100))*(LCC!$K$22*(1+G$12)))","v":0},{"$f":"((LCC!$K$19*(LCC!$K$21/100))*(LCC!$K$22*(1+H$12)))","v":0},{"$f":"((LCC!$K$19*(LCC!$K$21/100))*(LCC!$K$22*(1+I$12)))","v":0},{"$f":"((LCC!$K$19*(LCC!$K$21/100))*(LCC!$K$22*(1+J$12)))","v":0},{"$f":"((LCC!$K$19*(LCC!$K$21/100))*(LCC!$K$22*(1+K$12)))","v":0},{"$f":"((LCC!$K$19*(LCC!$K$21/100))*(LCC!$K$22*(1+L$12)))","v":0},{"$f":"((LCC!$K$19*(LCC!$K$21/100))*(LCC!$K$22*(1+M$12)))","v":0},{"$f":"((LCC!$K$19*(LCC!$K$21/100))*(LCC!$K$22*(1+N$12)))","v":0},{"$f":"SUM(Y31:INDEX(Y31:AI31,LCC!$E$6))","v":0},null,"prodotto 4",{"$f":"((LCC!$K$19*(LCC!$K$25/100))*LCC!$K$26)","v":0},{"$f":"((LCC!$K$19*(LCC!$K$25/100))*(LCC!$K$26*(1+$E$12)))","v":0},{"$f":"((LCC!$K$19*(LCC!$K$25/100))*(LCC!$K$26*(1+$F$12)))","v":0},{"$f":"((LCC!$K$19*(LCC!$K$25/100))*(LCC!$K$26*(1+$G$12)))","v":0},{"$f":"((LCC!$K$19*(LCC!$K$25/100))*(LCC!$K$26*(1+$H$12)))","v":0},{"$f":"((LCC!$K$19*(LCC!$K$25/100))*(LCC!$K$26*(1+$I$12)))","v":0},{"$f":"((LCC!$K$19*(LCC!$K$25/100))*(LCC!$K$26*(1+$J$12)))","v":0},{"$f":"((LCC!$K$19*(LCC!$K$25/100))*(LCC!$K$26*(1+$K$12)))","v":0},{"$f":"((LCC!$K$19*(LCC!$K$25/100))*(LCC!$K$26*(1+$L$12)))","v":0},{"$f":"((LCC!$K$19*(LCC!$K$25/100))*(LCC!$K$26*(1+$M$12)))","v":0},{"$f":"((LCC!$K$19*(LCC!$K$25/100))*(LCC!$K$26*(1+$N$12)))","v":0},{"$f":"SUM(AM31:INDEX(AM31:AW31,LCC!$E$6))","v":0}]
[null,"LPG ","prezzo previsto ($/gallone)",2.1800000000000002,2.19,2.25,2.34,{"$f":"AJ28","v":0},{"$f":"AJ29","v":0},{"$f":"AJ30","v":0},{"$f":"AJ31","v":0},{"$f":"$AJ32","v":0},{"$f":"$AJ33","v":0},{"$f":"$AJ34","v":0},{"$f":"$AJ35","v":0},{"$f":"$AJ36","v":0},{"$f":"$AJ37","v":0},null,null,null,null,null,null,"prodotto 5",{"$f":"((LCC!$M$19*(LCC!$M$21/100))*LCC!$M$22)","v":0},{"$f":"((LCC!$M$19*(LCC!$M$21/100))*(LCC!$M$22*(1+$E$12)))","v":0},{"$f":"((LCC!$M$19*(LCC!$M$21/100))*(LCC!$M$22*(1+$F$12)))","v":0},{"$f":"((LCC!$M$19*(LCC!$M$21/100))*(LCC!$M$22*(1+G$12)))","v":0},{"$f":"((LCC!$M$19*(LCC!$M$21/100))*(LCC!$M$22*(1+H$12)))","v":0},{"$f":"((LCC!$M$19*(LCC!$M$21/100))*(LCC!$M$22*(1+I$12)))","v":0},{"$f":"((LCC!$M$19*(LCC!$M$21/100))*(LCC!$M$22*(1+J$12)))","v":0},{"$f":"((LCC!$M$19*(LCC!$M$21/100))*(LCC!$M$22*(1+K$12)))","v":0},{"$f":"((LCC!$M$19*(LCC!$M$21/100))*(LCC!$M$22*(1+L$12)))","v":0},{"$f":"((LCC!$M$19*(LCC!$M$21/100))*(LCC!$M$22*(1+M$12)))","v":0},{"$f":"((LCC!$M$19*(LCC!$M$21/100))*(LCC!$M$22*(1+N$12)))","v":0},{"$f":"SUM(Y32:INDEX(Y32:AI32,LCC!$E$6))","v":0},null,"prodotto 5",{"$f":"((LCC!$M$19*(LCC!$M$25/100))*LCC!$M$26)","v":0},{"$f":"((LCC!$M$19*(LCC!$M$25/100))*(LCC!$M$26*(1+$E$12)))","v":0},{"$f":"((LCC!$M$19*(LCC!$M$25/100))*(LCC!$M$26*(1+$F$12)))","v":0},{"$f":"((LCC!$M$19*(LCC!$M$25/100))*(LCC!$M$26*(1+$G$12)))","v":0},{"$f":"((LCC!$M$19*(LCC!$M$25/100))*(LCC!$M$26*(1+$H$12)))","v":0},{"$f":"((LCC!$M$19*(LCC!$M$25/100))*(LCC!$M$26*(1+$I$12)))","v":0},{"$f":"((LCC!$M$19*(LCC!$M$25/100))*(LCC!$M$26*(1+$J$12)))","v":0},{"$f":"((LCC!$M$19*(LCC!$M$25/100))*(LCC!$M$26*(1+$K$12)))","v":0},{"$f":"((LCC!$M$19*(LCC!$M$25/100))*(LCC!$M$26*(1+$L$12)))","v":0},{"$f":"((LCC!$M$19*(LCC!$M$25/100))*(LCC!$M$26*(1+$M$12)))","v":0},{"$f":"((LCC!$M$19*(LCC!$M$25/100))*(LCC!$M$26*(1+$N$12)))","v":0},{"$f":"SUM(AM32:INDEX(AM32:AW32,LCC!$E$6))","v":0}]
[null,null,"% crescita/decrescita",null,2.7000000000000001E-3,2.9899999999999999E-2,7.0099999999999996E-2,{"$f":"AX28","v":0},{"$f":"AX29","v":0},{"$f":"AX30","v":0},{"$f":"AX31","v":0},{"$f":"AX32","v":0},{"$f":"AX33","v":0},{"$f":"AX34","v":0},{"$f":"AX35","v":0},{"$f":"AX36","v":0},{"$f":"AX37","v":0},null,null,null,null,null,null,"prodotto 6",{"$f":"((LCC!$O$19*(LCC!$O$21/100))*LCC!$O$22)","v":0},{"$f":"((LCC!$O$19*(LCC!$O$21/100))*(LCC!$O$22*(1+$E$12)))","v":0},{"$f":"((LCC!$O$19*(LCC!$O$21/100))*(LCC!$O$22*(1+$F$12)))","v":0},{"$f":"((LCC!$O$19*(LCC!$O$21/100))*(LCC!$O$22*(1+G$12)))","v":0},{"$f":"((LCC!$O$19*(LCC!$O$21/100))*(LCC!$O$22*(1+H$12)))","v":0},{"$f":"((LCC!$O$19*(LCC!$O$21/100))*(LCC!$O$22*(1+I$12)))","v":0},{"$f":"((LCC!$O$19*(LCC!$O$21/100))*(LCC!$O$22*(1+J$12)))","v":0},{"$f":"((LCC!$O$19*(LCC!$O$21/100))*(LCC!$O$22*(1+K$12)))","v":0},{"$f":"((LCC!$O$19*(LCC!$O$21/100))*(LCC!$O$22*(1+L$12)))","v":0},{"$f":"((LCC!$O$19*(LCC!$O$21/100))*(LCC!$O$22*(1+M$12)))","v":0},{"$f":"((LCC!$O$19*(LCC!$O$21/100))*(LCC!$O$22*(1+N$12)))","v":0},{"$f":"SUM(Y33:INDEX(Y33:AI33,LCC!$E$6))","v":0},null,"prodotto 6",{"$f":"((LCC!$O$19*(LCC!$O$25/100))*LCC!$O$26)","v":0},{"$f":"((LCC!$O$19*(LCC!$O$25/100))*(LCC!$O$26*(1+$E$12)))","v":0},{"$f":"((LCC!$O$19*(LCC!$O$25/100))*(LCC!$O$26*(1+$F$12)))","v":0},{"$f":"((LCC!$O$19*(LCC!$O$25/100))*(LCC!$O$26*(1+$G$12)))","v":0},{"$f":"((LCC!$O$19*(LCC!$O$25/100))*(LCC!$O$26*(1+$H$12)))","v":0},{"$f":"((LCC!$O$19*(LCC!$O$25/100))*(LCC!$O$26*(1+$I$12)))","v":0},{"$f":"((LCC!$O$19*(LCC!$O$25/100))*(LCC!$O$26*(1+$J$12)))","v":0},{"$f":"((LCC!$O$19*(LCC!$O$25/100))*(LCC!$O$26*(1+$K$12)))","v":0},{"$f":"((LCC!$O$19*(LCC!$O$25/100))*(LCC!$O$26*(1+$L$12)))","v":0},{"$f":"((LCC!$O$19*(LCC!$O$25/100))*(LCC!$O$26*(1+$M$12)))","v":0},{"$f":"((LCC!$O$19*(LCC!$O$25/100))*(LCC!$O$26*(1+$N$12)))","v":0},{"$f":"SUM(AM33:INDEX(AM33:AW33,LCC!$E$6))","v":0}]
[null,"etanolo","prezzo previsto ($/gallone)",2.57,2.58,2.59,2.6,{"$f":"AJ40","v":0},{"$f":"AJ41","v":0},{"$f":"AJ42","v":0},{"$f":"AJ43","v":0},{"$f":"#REF!","v":{"$error":"#REF!"}},{"$f":"#REF!","v":{"$error":"#REF!"}},{"$f":"#REF!","v":{"$error":"#REF!"}},{"$f":"$AJ47","v":0},{"$f":"$AJ48","v":0},{"$f":"$AJ49","v":0},null,null,null,null,null,null,"prodotto 7",{"$f":"((LCC!$Q$19*(LCC!$Q$21/100))*LCC!$Q$22)","v":0},{"$f":"((LCC!$Q$19*(LCC!$Q$21/100))*(LCC!$Q$22*(1+$E$12)))","v":0},{"$f":"((LCC!$Q$19*(LCC!$Q$21/100))*(LCC!$Q$22*(1+$F$12)))","v":0},{"$f":"((LCC!$Q$19*(LCC!$Q$21/100))*(LCC!$Q$22*(1+G$12)))","v":0},{"$f":"((LCC!$Q$19*(LCC!$Q$21/100))*(LCC!$Q$22*(1+H$12)))","v":0},{"$f":"((LCC!$Q$19*(LCC!$Q$21/100))*(LCC!$Q$22*(1+I$12)))","v":0},{"$f":"((LCC!$Q$19*(LCC!$Q$21/100))*(LCC!$Q$22*(1+J$12)))","v":0},{"$f":"((LCC!$Q$19*(LCC!$Q$21/100))*(LCC!$Q$22*(1+K$12)))","v":0},{"$f":"((LCC!$Q$19*(LCC!$Q$21/100))*(LCC!$Q$22*(1+L$12)))","v":0},{"$f":"((LCC!$Q$19*(LCC!$Q$21/100))*(LCC!$Q$22*(1+M$12)))","v":0},{"$f":"((LCC!$Q$19*(LCC!$Q$21/100))*(LCC!$Q$22*(1+N$12)))","v":0},{"$f":"SUM(Y34:INDEX(Y34:AI34,LCC!$E$6))","v":0},null,"prodotto 7",{"$f":"((LCC!$Q$19*(LCC!$Q$25/100))*LCC!$Q$26)","v":0},{"$f":"((LCC!$Q$19*(LCC!$Q$25/100))*(LCC!$Q$26*(1+$E$12)))","v":0},{"$f":"((LCC!$Q$19*(LCC!$Q$25/100))*(LCC!$Q$26*(1+$F$12)))","v":0},{"$f":"((LCC!$Q$19*(LCC!$Q$25/100))*(LCC!$Q$26*(1+$G$12)))","v":0},{"$f":"((LCC!$Q$19*(LCC!$Q$25/100))*(LCC!$Q$26*(1+$H$12)))","v":0},{"$f":"((LCC!$Q$19*(LCC!$Q$25/100))*(LCC!$Q$26*(1+$I$12)))","v":0},{"$f":"((LCC!$Q$19*(LCC!$Q$25/100))*(LCC!$Q$26*(1+$J$12)))","v":0},{"$f":"((LCC!$Q$19*(LCC!$Q$25/100))*(LCC!$Q$26*(1+$K$12)))","v":0},{"$f":"((LCC!$Q$19*(LCC!$Q$25/100))*(LCC!$Q$26*(1+$L$12)))","v":0},{"$f":"((LCC!$Q$19*(LCC!$Q$25/100))*(LCC!$Q$26*(1+$M$12)))","v":0},{"$f":"((LCC!$Q$19*(LCC!$Q$25/100))*(LCC!$Q$26*(1+$N$12)))","v":0},{"$f":"SUM(AM34:INDEX(AM34:AW34,LCC!$E$6))","v":0}]
[null,null,"% crescita/decrescita",null,3.3999999999999998E-3,1.04E-2,1.32E-2,{"$f":"$AX40","v":0},{"$f":"$AX41","v":0},{"$f":"$AX42","v":0},{"$f":"$AX43","v":0},{"$f":"#REF!","v":{"$error":"#REF!"}},{"$f":"#REF!","v":{"$error":"#REF!"}},{"$f":"#REF!","v":{"$error":"#REF!"}},{"$f":"$AX44","v":0},{"$f":"$AX45","v":0},{"$f":"$AX46","v":0},null,null,null,null,null,null,"prodotto 8",{"$f":"((LCC!$S$19*(LCC!$S$21/100))*LCC!$S$22)","v":0},{"$f":"((LCC!$S$19*(LCC!$S$21/100))*(LCC!$S$22*(1+$E$12)))","v":0},{"$f":"((LCC!$S$19*(LCC!$S$21/100))*(LCC!$S$22*(1+$F$12)))","v":0},{"$f":"((LCC!$S$19*(LCC!$S$21/100))*(LCC!$S$22*(1+G$12)))","v":0},{"$f":"((LCC!$S$19*(LCC!$S$21/100))*(LCC!$S$22*(1+H$12)))","v":0},{"$f":"((LCC!$S$19*(LCC!$S$21/100))*(LCC!$S$22*(1+I$12)))","v":0},{"$f":"((LCC!$S$19*(LCC!$S$21/100))*(LCC!$S$22*(1+J$12)))","v":0},{"$f":"((LCC!$S$19*(LCC!$S$21/100))*(LCC!$S$22*(1+K$12)))","v":0},{"$f":"((LCC!$S$19*(LCC!$S$21/100))*(LCC!$S$22*(1+L$12)))","v":0},{"$f":"((LCC!$S$19*(LCC!$S$21/100))*(LCC!$S$22*(1+M$12)))","v":0},{"$f":"((LCC!$S$19*(LCC!$S$21/100))*(LCC!$S$22*(1+N$12)))","v":0},{"$f":"SUM(Y35:INDEX(Y35:AI35,LCC!$E$6))","v":0},null,"prodotto 8",{"$f":"((LCC!$S$19*(LCC!$S$25/100))*LCC!$S$26)","v":0},{"$f":"((LCC!$S$19*(LCC!$S$25/100))*(LCC!$S$26*(1+$E$12)))","v":0},{"$f":"((LCC!$S$19*(LCC!$S$25/100))*(LCC!$S$26*(1+$F$12)))","v":0},{"$f":"((LCC!$S$19*(LCC!$S$25/100))*(LCC!$S$26*(1+$G$12)))","v":0},{"$f":"((LCC!$S$19*(LCC!$S$25/100))*(LCC!$S$26*(1+$H$12)))","v":0},{"$f":"((LCC!$S$19*(LCC!$S$25/100))*(LCC!$S$26*(1+$I$12)))","v":0},{"$f":"((LCC!$S$19*(LCC!$S$25/100))*(LCC!$S$26*(1+$J$12)))","v":0},{"$f":"((LCC!$S$19*(LCC!$S$25/100))*(LCC!$S$26*(1+$K$12)))","v":0},{"$f":"((LCC!$S$19*(LCC!$S$25/100))*(LCC!$S$26*(1+$L$12)))","v":0},{"$f":"((LCC!$S$19*(LCC!$S$25/100))*(LCC!$S$26*(1+$M$12)))","v":0},{"$f":"((LCC!$S$19*(LCC!$S$25/100))*(LCC!$S$26*(1+$N$12)))","v":0},{"$f":"SUM(AM35:INDEX(AM35:AW35,LCC!$E$6))","v":0}]
[null,"elettricità","prezzo previsto ($cents/Kwh)",10.210000000000001,10.1,10.199999999999999,10.16,{"$f":"AJ52","v":0},{"$f":"AJ53","v":0},{"$f":"$AJ54","v":0},{"$f":"$AJ55","v":0},{"$f":"$AJ56","v":0},{"$f":"$AJ57","v":0},{"$f":"$AJ58","v":0},{"$f":"$AJ59","v":0},{"$f":"$AJ60","v":0},{"$f":"$AJ61","v":0},null,null,null,null,null,null,"prodotto 9",{"$f":"((LCC!$U$19*(LCC!$U$21/100))*LCC!$U$22)","v":0},{"$f":"((LCC!$U$19*(LCC!$U$21/100))*(LCC!$U$22*(1+$E$12)))","v":0},{"$f":"((LCC!$U$19*(LCC!$U$21/100))*(LCC!$U$22*(1+$F$12)))","v":0},{"$f":"((LCC!$U$19*(LCC!$U$21/100))*(LCC!$U$22*(1+G$12)))","v":0},{"$f":"((LCC!$U$19*(LCC!$U$21/100))*(LCC!$U$22*(1+H$12)))","v":0},{"$f":"((LCC!$U$19*(LCC!$U$21/100))*(LCC!$U$22*(1+I$12)))","v":0},{"$f":"((LCC!$U$19*(LCC!$U$21/100))*(LCC!$U$22*(1+J$12)))","v":0},{"$f":"((LCC!$U$19*(LCC!$U$21/100))*(LCC!$U$22*(1+K$12)))","v":0},{"$f":"((LCC!$U$19*(LCC!$U$21/100))*(LCC!$U$22*(1+L$12)))","v":0},{"$f":"((LCC!$U$19*(LCC!$U$21/100))*(LCC!$U$22*(1+M$12)))","v":0},{"$f":"((LCC!$U$19*(LCC!$U$21/100))*(LCC!$U$22*(1+N$12)))","v":0},{"$f":"SUM(Y36:INDEX(Y36:AI36,LCC!$E$6))","v":0},null,"prodotto 9",{"$f":"((LCC!$U$19*(LCC!$U$25/100))*LCC!$U$26)","v":0},{"$f":"((LCC!$U$19*(LCC!$U$25/100))*(LCC!$U$26*(1+$E$12)))","v":0},{"$f":"((LCC!$U$19*(LCC!$U$25/100))*(LCC!$U$26*(1+$F$12)))","v":0},{"$f":"((LCC!$U$19*(LCC!$U$25/100))*(LCC!$U$26*(1+$G$12)))","v":0},{"$f":"((LCC!$U$19*(LCC!$U$25/100))*(LCC!$U$26*(1+$H$12)))","v":0},{"$f":"((LCC!$U$19*(LCC!$U$25/100))*(LCC!$U$26*(1+$I$12)))","v":0},{"$f":"((LCC!$U$19*(LCC!$U$25/100))*(LCC!$U$26*(1+$J$12)))","v":0},{"$f":"((LCC!$U$19*(LCC!$U$25/100))*(LCC!$U$26*(1+$K$12)))","v":0},{"$f":"((LCC!$U$19*(LCC!$U$25/100))*(LCC!$U$26*(1+$L$12)))","v":0},{"$f":"((LCC!$U$19*(LCC!$U$25/100))*(LCC!$U$26*(1+$M$12)))","v":0},{"$f":"((LCC!$U$19*(LCC!$U$25/100))*(LCC!$U$26*(1+$N$12)))","v":0},{"$f":"SUM(AM36:INDEX(AM36:AW36,LCC!$E$6))","v":0}]
[null,null,"% crescita/decrescita",null,-1.1900000000000001E-2,2.8999999999999998E-3,-0.49,{"$f":"AX49","v":0},{"$f":"AX50","v":0},{"$f":"AX51","v":22209},{"$f":"AX52","v":0},{"$f":"AX53","v":0},{"$f":"AX54","v":0},{"$f":"AX55","v":0},{"$f":"AX56","v":0},{"$f":"AX57","v":0},{"$f":"AX58","v":0},null,null,null,null,null,null,"prodotto 10",{"$f":"((LCC!$W$19*(LCC!$W$21/100))*LCC!$W$22)","v":0},{"$f":"((LCC!$W$19*(LCC!$W$21/100))*(LCC!$W$22*(1+$E$12)))","v":0},{"$f":"((LCC!$W$19*(LCC!$W$21/100))*(LCC!$W$22*(1+$F$12)))","v":0},{"$f":"((LCC!$W$19*(LCC!$W$21/100))*(LCC!$W$22*(1+G$12)))","v":0},{"$f":"((LCC!$W$19*(LCC!$W$21/100))*(LCC!$W$22*(1+H$12)))","v":0},{"$f":"((LCC!$W$19*(LCC!$W$21/100))*(LCC!$W$22*(1+I$12)))","v":0},{"$f":"((LCC!$W$19*(LCC!$W$21/100))*(LCC!$W$22*(1+J$12)))","v":0},{"$f":"((LCC!$W$19*(LCC!$W$21/100))*(LCC!$W$22*(1+K$12)))","v":0},{"$f":"((LCC!$W$19*(LCC!$W$21/100))*(LCC!$W$22*(1+L$12)))","v":0},{"$f":"((LCC!$W$19*(LCC!$W$21/100))*(LCC!$W$22*(1+M$12)))","v":0},{"$f":"((LCC!$W$19*(LCC!$W$21/100))*(LCC!$W$22*(1+N$12)))","v":0},{"$f":"SUM(Y37:INDEX(Y37:AI37,LCC!$E$6))","v":0},null,"prodotto 10",{"$f":"((LCC!$W$19*(LCC!$W$25/100))*LCC!$W$26)","v":0},{"$f":"((LCC!$W$19*(LCC!$W$25/100))*(LCC!$W$26*(1+$E$12)))","v":0},{"$f":"((LCC!$W$19*(LCC!$W$25/100))*(LCC!$W$26*(1+$F$12)))","v":0},{"$f":"((LCC!$W$19*(LCC!$W$25/100))*(LCC!$W$26*(1+$G$12)))","v":0},{"$f":"((LCC!$W$19*(LCC!$W$25/100))*(LCC!$W$26*(1+$H$12)))","v":0},{"$f":"((LCC!$W$19*(LCC!$W$25/100))*(LCC!$W$26*(1+$I$12)))","v":0},{"$f":"((LCC!$W$19*(LCC!$W$25/100))*(LCC!$W$26*(1+$J$12)))","v":0},{"$f":"((LCC!$W$19*(LCC!$W$25/100))*(LCC!$W$26*(1+$K$12)))","v":0},{"$f":"((LCC!$W$19*(LCC!$W$25/100))*(LCC!$W$26*(1+$L$12)))","v":0},{"$f":"((LCC!$W$19*(LCC!$W$25/100))*(LCC!$W$26*(1+$M$12)))","v":0},{"$f":"((LCC!$W$19*(LCC!$W$25/100))*(LCC!$W$26*(1+$N$12)))","v":0},{"$f":"SUM(AM37:INDEX(AM37:AW37,LCC!$E$6))","v":0}]
[null,"Biodiesel ","prezzo previsto ($/100 litro)",156.19999999999999,154.69999999999999,159.80000000000001,177.6,{"$f":"AJ64","v":0},{"$f":"AJ65","v":0},{"$f":"AJ66","v":0},{"$f":"AJ67","v":0},{"$f":"$AJ68","v":0},{"$f":"$AJ69","v":0},{"$f":"$AJ70","v":0},{"$f":"$AJ71","v":0},{"$f":"$AJ72","v":0},{"$f":"$AJ73","v":0}]
[null,null,"% crescita/decrescita",null,-8.3000000000000001E-3,2.47E-2,0.13170000000000001,{"$f":"AX61","v":0},{"$f":"AX62","v":0},{"$f":"AX63","v":22209},{"$f":"AX64","v":0},{"$f":"AX65","v":0},{"$f":"AX66","v":0},{"$f":"AX67","v":0},{"$f":"AX68","v":0},{"$f":"AX69","v":0},{"$f":"AX70","v":0},null,null,null,null,null,null,"ETHANOL",2014,2015,2016,2017,2018,2019,2020,2021,2022,2023,2024,"Total fuel price for period",null,"Ethanol"]
[null,"Natural Gas ","prezzo previsto ($/millionBtu)",16.09,16.73,17.170000000000002,18.170000000000002,{"$f":"AJ76","v":0},{"$f":"AJ77","v":0},{"$f":"AJ78","v":0},{"$f":"AJ79","v":0},{"$f":"$AJ80","v":0},{"$f":"$AJ81","v":0},{"$f":"$AJ82","v":0},{"$f":"$AJ83","v":0},{"$f":"$AJ84","v":0},{"$f":"$AJ85","v":0},null,null,null,null,null,null,"prodotto 1",{"$f":"((LCC!$E$19*(LCC!$E$21/100))*LCC!$E$22)","v":0},{"$f":"((LCC!$E$19*(LCC!$E$21/100))*(LCC!$E$22*(1+$E$15)))","v":0},{"$f":"((LCC!$E$19*(LCC!$E$21/100))*(LCC!$E$22*(1+$F$15)))","v":0},{"$f":"((LCC!$E$19*(LCC!$E$21/100))*(LCC!$E$22*(1+G$15)))","v":0},{"$f":"((LCC!$E$19*(LCC!$E$21/100))*(LCC!$E$22*(1+H$15)))","v":0},{"$f":"((LCC!$E$19*(LCC!$E$21/100))*(LCC!$E$22*(1+I$15)))","v":0},{"$f":"((LCC!$E$19*(LCC!$E$21/100))*(LCC!$E$22*(1+J$15)))","v":0},{"$f":"((LCC!$E$19*(LCC!$E$21/100))*(LCC!$E$22*(1+K$15)))","v":0},{"$f":"((LCC!$E$19*(LCC!$E$21/100))*(LCC!$E$22*(1+L$15)))","v":0},{"$f":"((LCC!$E$19*(LCC!$E$21/100))*(LCC!$E$22*(1+M$15)))","v":0},{"$f":"((LCC!$E$19*(LCC!$E$21/100))*(LCC!$E$22*(1+N$15)))","v":0},{"$f":"SUM(Y40:INDEX(Y40:AI40,LCC!$E$6))","v":0},null,"prodotto 1",{"$f":"((LCC!$E$19*(LCC!$E$25/100))*LCC!$E$26)","v":0},{"$f":"((LCC!$E$19*(LCC!$E$25/100))*(LCC!$E$26*(1+$E$15)))","v":0},{"$f":"((LCC!$E$19*(LCC!$E$25/100))*(LCC!$E$26*(1+$F$15)))","v":0},{"$f":"((LCC!$E$19*(LCC!$E$25/100))*(LCC!$E$26*(1+$G$15)))","v":0},{"$f":"((LCC!$E$19*(LCC!$E$25/100))*(LCC!$E$26*(1+$H$15)))","v":0},{"$f":"((LCC!$E$19*(LCC!$E$25/100))*(LCC!$E$26*(1+$I$15)))","v":0},{"$f":"((LCC!$E$19*(LCC!$E$25/100))*(LCC!$E$26*(1+$J$15)))","v":0},{"$f":"((LCC!$E$19*(LCC!$E$25/100))*(LCC!$E$26*(1+$K$15)))","v":0},{"$f":"((LCC!$E$19*(LCC!$E$25/100))*(LCC!$E$26*(1+$L$15)))","v":0},{"$f":"((LCC!$E$19*(LCC!$E$25/100))*(LCC!$E$26*(1+$M$15)))","v":0},{"$f":"((LCC!$E$19*(LCC!$E$25/100))*(LCC!$E$26*(1+$N$15)))","v":0},{"$f":"SUM(AM40:INDEX(AM40:AW40,LCC!$E$6))","v":0}]
[null,null,"% crescita/decrescita",null,3.9399999999999998E-2,6.5600000000000006E-2,0.1225,{"$f":"AX73","v":0},{"$f":"AX74","v":0},{"$f":"AX75","v":22209},{"$f":"$AX76","v":0},{"$f":"$AX77","v":0},{"$f":"$AX78","v":0},{"$f":"$AX79","v":0},{"$f":"$AX80","v":0},{"$f":"$AX81","v":0},{"$f":"$AX82","v":0},null,null,null,null,null,null,"prodotto 2",{"$f":"((LCC!$G$19*(LCC!$G$21/100))*LCC!$G$22)","v":0},{"$f":"((LCC!$G$19*(LCC!$G$21/100))*(LCC!$G$22*(1+$E$15)))","v":0},{"$f":"((LCC!$G$19*(LCC!$G$21/100))*(LCC!$G$22*(1+$F$15)))","v":0},{"$f":"((LCC!$G$19*(LCC!$G$21/100))*(LCC!$G$22*(1+G$15)))","v":0},{"$f":"((LCC!$G$19*(LCC!$G$21/100))*(LCC!$G$22*(1+H$15)))","v":0},{"$f":"((LCC!$G$19*(LCC!$G$21/100))*(LCC!$G$22*(1+I$15)))","v":0},{"$f":"((LCC!$G$19*(LCC!$G$21/100))*(LCC!$G$22*(1+J$15)))","v":0},{"$f":"((LCC!$G$19*(LCC!$G$21/100))*(LCC!$G$22*(1+K$15)))","v":0},{"$f":"((LCC!$G$19*(LCC!$G$21/100))*(LCC!$G$22*(1+L$15)))","v":0},{"$f":"((LCC!$G$19*(LCC!$G$21/100))*(LCC!$G$22*(1+M$15)))","v":0},{"$f":"((LCC!$G$19*(LCC!$G$21/100))*(LCC!$G$22*(1+N$15)))","v":0},{"$f":"SUM(Y41:INDEX(Y41:AI41,LCC!$E$6))","v":0},null,"prodotto 2",{"$f":"((LCC!$G$19*(LCC!$G$25/100))*LCC!$G$26)","v":0},{"$f":"((LCC!$G$19*(LCC!$G$25/100))*(LCC!$G$26*(1+$E$15)))","v":0},{"$f":"((LCC!$G$19*(LCC!$G$25/100))*(LCC!$G$26*(1+$F$15)))","v":0},{"$f":"((LCC!$G$19*(LCC!$G$25/100))*(LCC!$G$26*(1+$G$15)))","v":0},{"$f":"((LCC!$G$19*(LCC!$G$25/100))*(LCC!$G$26*(1+$H$15)))","v":0},{"$f":"((LCC!$G$19*(LCC!$G$25/100))*(LCC!$G$26*(1+$I$15)))","v":0},{"$f":"((LCC!$G$19*(LCC!$G$25/100))*(LCC!$G$26*(1+$J$15)))","v":0},{"$f":"((LCC!$G$19*(LCC!$G$25/100))*(LCC!$G$26*(1+$K$15)))","v":0},{"$f":"((LCC!$G$19*(LCC!$G$25/100))*(LCC!$G$26*(1+$L$15)))","v":0},{"$f":"((LCC!$G$19*(LCC!$G$25/100))*(LCC!$G$26*(1+$M$15)))","v":0},{"$f":"((LCC!$G$19*(LCC!$G$25/100))*(LCC!$G$26*(1+$N$15)))","v":0},{"$f":"SUM(AM41:INDEX(AM41:AW41,LCC!$E$6))","v":0}]
[null,null,null,null,null,null,null,null,null,null,null,null,null,null,null,null,null,null,null,null,null,null,null,"prodotto 3",{"$f":"((LCC!$I$19*(LCC!$I$21/100))*LCC!$I$22)","v":0},{"$f":"((LCC!$I$19*(LCC!$I$21/100))*(LCC!$I$22*(1+$E$15)))","v":0},{"$f":"((LCC!$I$19*(LCC!$I$21/100))*(LCC!$I$22*(1+$F$15)))","v":0},{"$f":"((LCC!$I$19*(LCC!$I$21/100))*(LCC!$I$22*(1+G$15)))","v":0},{"$f":"((LCC!$I$19*(LCC!$I$21/100))*(LCC!$I$22*(1+H$15)))","v":0},{"$f":"((LCC!$I$19*(LCC!$I$21/100))*(LCC!$I$22*(1+I$15)))","v":0},{"$f":"((LCC!$I$19*(LCC!$I$21/100))*(LCC!$I$22*(1+J$15)))","v":0},{"$f":"((LCC!$I$19*(LCC!$I$21/100))*(LCC!$I$22*(1+K$15)))","v":0},{"$f":"((LCC!$I$19*(LCC!$I$21/100))*(LCC!$I$22*(1+L$15)))","v":0},{"$f":"((LCC!$I$19*(LCC!$I$21/100))*(LCC!$I$22*(1+M$15)))","v":0},{"$f":"((LCC!$I$19*(LCC!$I$21/100))*(LCC!$I$22*(1+N$15)))","v":0},{"$f":"SUM(Y42:INDEX(Y42:AI42,LCC!$E$6))","v":0},null,"prodotto 3",{"$f":"((LCC!$I$19*(LCC!$I$25/100))*LCC!$I$26)","v":0},{"$f":"((LCC!$I$19*(LCC!$I$25/100))*(LCC!$I$26*(1+$E$15)))","v":0},{"$f":"((LCC!$I$19*(LCC!$I$25/100))*(LCC!$I$26*(1+$F$15)))","v":0},{"$f":"((LCC!$I$19*(LCC!$I$25/100))*(LCC!$I$26*(1+$G$15)))","v":0},{"$f":"((LCC!$I$19*(LCC!$I$25/100))*(LCC!$I$26*(1+$H$15)))","v":0},{"$f":"((LCC!$I$19*(LCC!$I$25/100))*(LCC!$I$26*(1+$I$15)))","v":0},{"$f":"((LCC!$I$19*(LCC!$I$25/100))*(LCC!$I$26*(1+$J$15)))","v":0},{"$f":"((LCC!$I$19*(LCC!$I$25/100))*(LCC!$I$26*(1+$K$15)))","v":0},{"$f":"((LCC!$I$19*(LCC!$I$25/100))*(LCC!$I$26*(1+$L$15)))","v":0},{"$f":"((LCC!$I$19*(LCC!$I$25/100))*(LCC!$I$26*(1+$M$15)))","v":0},{"$f":"((LCC!$I$19*(LCC!$I$25/100))*(LCC!$I$26*(1+$N$15)))","v":0},{"$f":"SUM(AM42:INDEX(AM42:AW42,LCC!$E$6))","v":0}]
[null,null,null,null,null,null,null,null,null,null,null,null,null,null,null,null,null,null,null,null,null,null,null,"prodotto 4",{"$f":"((LCC!$K$19*(LCC!$K$21/100))*LCC!$K$22)","v":0},{"$f":"((LCC!$K$19*(LCC!$K$21/100))*(LCC!$K$22*(1+$E$15)))","v":0},{"$f":"((LCC!$K$19*(LCC!$K$21/100))*(LCC!$K$22*(1+$F$15)))","v":0},{"$f":"((LCC!$K$19*(LCC!$K$21/100))*(LCC!$K$22*(1+G$15)))","v":0},{"$f":"((LCC!$K$19*(LCC!$K$21/100))*(LCC!$K$22*(1+H$15)))","v":0},{"$f":"((LCC!$K$19*(LCC!$K$21/100))*(LCC!$K$22*(1+I$15)))","v":0},{"$f":"((LCC!$K$19*(LCC!$K$21/100))*(LCC!$K$22*(1+J$15)))","v":0},{"$f":"((LCC!$K$19*(LCC!$K$21/100))*(LCC!$K$22*(1+K$15)))","v":0},{"$f":"((LCC!$K$19*(LCC!$K$21/100))*(LCC!$K$22*(1+L$15)))","v":0},{"$f":"((LCC!$K$19*(LCC!$K$21/100))*(LCC!$K$22*(1+M$15)))","v":0},{"$f":"((LCC!$K$19*(LCC!$K$21/100))*(LCC!$K$22*(1+N$15)))","v":0},{"$f":"SUM(Y43:INDEX(Y43:AI43,LCC!$E$6))","v":0},null,"prodotto 4",{"$f":"((LCC!$K$19*(LCC!$K$25/100))*LCC!$K$26)","v":0},{"$f":"((LCC!$K$19*(LCC!$K$25/100))*(LCC!$K$26*(1+$E$15)))","v":0},{"$f":"((LCC!$K$19*(LCC!$K$25/100))*(LCC!$K$26*(1+$F$15)))","v":0},{"$f":"((LCC!$K$19*(LCC!$K$25/100))*(LCC!$K$26*(1+$G$15)))","v":0},{"$f":"((LCC!$K$19*(LCC!$K$25/100))*(LCC!$K$26*(1+$H$15)))","v":0},{"$f":"((LCC!$K$19*(LCC!$K$25/100))*(LCC!$K$26*(1+$I$15)))","v":0},{"$f":"((LCC!$K$19*(LCC!$K$25/100))*(LCC!$K$26*(1+$J$15)))","v":0},{"$f":"((LCC!$K$19*(LCC!$K$25/100))*(LCC!$K$26*(1+$K$15)))","v":0},{"$f":"((LCC!$K$19*(LCC!$K$25/100))*(LCC!$K$26*(1+$L$15)))","v":0},{"$f":"((LCC!$K$19*(LCC!$K$25/100))*(LCC!$K$26*(1+$M$15)))","v":0},{"$f":"((LCC!$K$19*(LCC!$K$25/100))*(LCC!$K$26*(1+$N$15)))","v":0},{"$f":"SUM(AM43:INDEX(AM43:AW43,LCC!$E$6))","v":0}]
["*** tutti i prezzi sono stati calcolati per il settore dei trasporti ",null,null,null,null,null,null,null,null,null,null,null,null,null,null,null,null,null,null,null,null,null,null,"prodotto 5",{"$f":"((LCC!$M$19*(LCC!$M$21/100))*LCC!$M$22)","v":0},{"$f":"((LCC!$M$19*(LCC!$M$21/100))*(LCC!$M$22*(1+$E$15)))","v":0},{"$f":"((LCC!$M$19*(LCC!$M$21/100))*(LCC!$M$22*(1+$F$15)))","v":0},{"$f":"((LCC!$M$19*(LCC!$M$21/100))*(LCC!$M$22*(1+G$15)))","v":0},{"$f":"((LCC!$M$19*(LCC!$M$21/100))*(LCC!$M$22*(1+H$15)))","v":0},{"$f":"((LCC!$M$19*(LCC!$M$21/100))*(LCC!$M$22*(1+I$15)))","v":0},{"$f":"((LCC!$M$19*(LCC!$M$21/100))*(LCC!$M$22*(1+J$15)))","v":0},{"$f":"((LCC!$M$19*(LCC!$M$21/100))*(LCC!$M$22*(1+K$15)))","v":0},{"$f":"((LCC!$M$19*(LCC!$M$21/100))*(LCC!$M$22*(1+L$15)))","v":0},{"$f":"((LCC!$M$19*(LCC!$M$21/100))*(LCC!$M$22*(1+M$15)))","v":0},{"$f":"((LCC!$M$19*(LCC!$M$21/100))*(LCC!$M$22*(1+N$15)))","v":0},{"$f":"SUM(Y44:INDEX(Y44:AI44,LCC!$E$6))","v":0},null,"prodotto 8",{"$f":"((LCC!$M$19*(LCC!$M$25/100))*LCC!$M$26)","v":0},{"$f":"((LCC!$M$19*(LCC!$M$25/100))*(LCC!$M$26*(1+$E$15)))","v":0},{"$f":"((LCC!$M$19*(LCC!$M$25/100))*(LCC!$M$26*(1+$F$15)))","v":0},{"$f":"((LCC!$M$19*(LCC!$M$25/100))*(LCC!$M$26*(1+$G$15)))","v":0},{"$f":"((LCC!$M$19*(LCC!$M$25/100))*(LCC!$M$26*(1+$H$15)))","v":0},{"$f":"((LCC!$M$19*(LCC!$M$25/100))*(LCC!$M$26*(1+$I$15)))","v":0},{"$f":"((LCC!$M$19*(LCC!$M$25/100))*(LCC!$M$26*(1+$J$15)))","v":0},{"$f":"((LCC!$M$19*(LCC!$M$25/100))*(LCC!$M$26*(1+$K$15)))","v":0},{"$f":"((LCC!$M$19*(LCC!$M$25/100))*(LCC!$M$26*(1+$L$15)))","v":0},{"$f":"((LCC!$M$19*(LCC!$M$25/100))*(LCC!$M$26*(1+$M$15)))","v":0},{"$f":"((LCC!$M$19*(LCC!$M$25/100))*(LCC!$M$26*(1+$N$15)))","v":0},{"$f":"SUM(AM44:INDEX(AM44:AW44,LCC!$E$6))","v":0}]
[null,null,null,null,null,null,null,null,null,null,null,null,null,null,null,null,null,null,null,null,null,null,null,"prodotto 6",{"$f":"((LCC!$O$19*(LCC!$O$21/100))*LCC!$O$22)","v":0},{"$f":"((LCC!$O$19*(LCC!$O$21/100))*(LCC!$O$22*(1+$E$15)))","v":0},{"$f":"((LCC!$O$19*(LCC!$O$21/100))*(LCC!$O$22*(1+$F$15)))","v":0},{"$f":"((LCC!$O$19*(LCC!$O$21/100))*(LCC!$O$22*(1+G$15)))","v":0},{"$f":"((LCC!$O$19*(LCC!$O$21/100))*(LCC!$O$22*(1+H$15)))","v":0},{"$f":"((LCC!$O$19*(LCC!$O$21/100))*(LCC!$O$22*(1+I$15)))","v":0},{"$f":"((LCC!$O$19*(LCC!$O$21/100))*(LCC!$O$22*(1+J$15)))","v":0},{"$f":"((LCC!$O$19*(LCC!$O$21/100))*(LCC!$O$22*(1+K$15)))","v":0},{"$f":"((LCC!$O$19*(LCC!$O$21/100))*(LCC!$O$22*(1+L$15)))","v":0},{"$f":"((LCC!$O$19*(LCC!$O$21/100))*(LCC!$O$22*(1+M$15)))","v":0},{"$f":"((LCC!$O$19*(LCC!$O$21/100))*(LCC!$O$22*(1+N$15)))","v":0},{"$f":"SUM(Y45:INDEX(Y45:AI45,LCC!$E$6))","v":0},null,"prodotto 9",{"$f":"((LCC!$O$19*(LCC!$O$25/100))*LCC!$O$26)","v":0},{"$f":"((LCC!$O$19*(LCC!$O$25/100))*(LCC!$O$26*(1+$E$15)))","v":0},{"$f":"((LCC!$O$19*(LCC!$O$25/100))*(LCC!$O$26*(1+$F$15)))","v":0},{"$f":"((LCC!$O$19*(LCC!$O$25/100))*(LCC!$O$26*(1+$G$15)))","v":0},{"$f":"((LCC!$O$19*(LCC!$O$25/100))*(LCC!$O$26*(1+$H$15)))","v":0},{"$f":"((LCC!$O$19*(LCC!$O$25/100))*(LCC!$O$26*(1+$I$15)))","v":0},{"$f":"((LCC!$O$19*(LCC!$O$25/100))*(LCC!$O$26*(1+$J$15)))","v":0},{"$f":"((LCC!$O$19*(LCC!$O$25/100))*(LCC!$O$26*(1+$K$15)))","v":0},{"$f":"((LCC!$O$19*(LCC!$O$25/100))*(LCC!$O$26*(1+$L$15)))","v":0},{"$f":"((LCC!$O$19*(LCC!$O$25/100))*(LCC!$O$26*(1+$M$15)))","v":0},{"$f":"((LCC!$O$19*(LCC!$O$25/100))*(LCC!$O$26*(1+$N$15)))","v":0},{"$f":"SUM(AM45:INDEX(AM45:AW45,LCC!$E$6))","v":0}]
[null,null,null,null,null,null,null,null,null,null,null,null,null,null,null,null,null,null,null,null,null,null,null,"prodotto 7",{"$f":"((LCC!$Q$19*(LCC!$Q$21/100))*LCC!$Q$22)","v":0},{"$f":"((LCC!$Q$19*(LCC!$Q$21/100))*(LCC!$Q$22*(1+$E$15)))","v":0},{"$f":"((LCC!$Q$19*(LCC!$Q$21/100))*(LCC!$Q$22*(1+$F$15)))","v":0},{"$f":"((LCC!$Q$19*(LCC!$Q$21/100))*(LCC!$Q$22*(1+G$15)))","v":0},{"$f":"((LCC!$Q$19*(LCC!$Q$21/100))*(LCC!$Q$22*(1+H$15)))","v":0},{"$f":"((LCC!$Q$19*(LCC!$Q$21/100))*(LCC!$Q$22*(1+I$15)))","v":0},{"$f":"((LCC!$Q$19*(LCC!$Q$21/100))*(LCC!$Q$22*(1+J$15)))","v":0},{"$f":"((LCC!$Q$19*(LCC!$Q$21/100))*(LCC!$Q$22*(1+K$15)))","v":0},{"$f":"((LCC!$Q$19*(LCC!$Q$21/100))*(LCC!$Q$22*(1+L$15)))","v":0},{"$f":"((LCC!$Q$19*(LCC!$Q$21/100))*(LCC!$Q$22*(1+M$15)))","v":0},{"$f":"((LCC!$Q$19*(LCC!$Q$21/100))*(LCC!$Q$22*(1+N$15)))","v":0},{"$f":"SUM(Y46:INDEX(Y46:AI46,LCC!$E$6))","v":0},null,"prodotto 10",{"$f":"((LCC!$Q$19*(LCC!$Q$25/100))*LCC!$Q$26)","v":0},{"$f":"((LCC!$Q$19*(LCC!$Q$25/100))*(LCC!$Q$26*(1+$E$15)))","v":0},{"$f":"((LCC!$Q$19*(LCC!$Q$25/100))*(LCC!$Q$26*(1+$F$15)))","v":0},{"$f":"((LCC!$Q$19*(LCC!$Q$25/100))*(LCC!$Q$26*(1+$G$15)))","v":0},{"$f":"((LCC!$Q$19*(LCC!$Q$25/100))*(LCC!$Q$26*(1+$H$15)))","v":0},{"$f":"((LCC!$Q$19*(LCC!$Q$25/100))*(LCC!$Q$26*(1+$I$15)))","v":0},{"$f":"((LCC!$Q$19*(LCC!$Q$25/100))*(LCC!$Q$26*(1+$J$15)))","v":0},{"$f":"((LCC!$Q$19*(LCC!$Q$25/100))*(LCC!$Q$26*(1+$K$15)))","v":0},{"$f":"((LCC!$Q$19*(LCC!$Q$25/100))*(LCC!$Q$26*(1+$L$15)))","v":0},{"$f":"((LCC!$Q$19*(LCC!$Q$25/100))*(LCC!$Q$26*(1+$M$15)))","v":0},{"$f":"((LCC!$Q$19*(LCC!$Q$25/100))*(LCC!$Q$26*(1+$N$15)))","v":0},{"$f":"SUM(AM46:INDEX(AM46:AW46,LCC!$E$6))","v":0}]
[null,null,null,null,null,null,null,null,null,null,null,null,null,null,null,null,null,null,null,null,null,null,null,"prodotto 8",{"$f":"((LCC!$S$19*(LCC!$S$21/100))*LCC!$S$22)","v":0},{"$f":"((LCC!$S$19*(LCC!$S$21/100))*(LCC!$S$22*(1+$E$15)))","v":0},{"$f":"((LCC!$S$19*(LCC!$S$21/100))*(LCC!$S$22*(1+$F$15)))","v":0},{"$f":"((LCC!$S$19*(LCC!$S$21/100))*(LCC!$S$22*(1+G$15)))","v":0},{"$f":"((LCC!$S$19*(LCC!$S$21/100))*(LCC!$S$22*(1+H$15)))","v":0},{"$f":"((LCC!$S$19*(LCC!$S$21/100))*(LCC!$S$22*(1+I$15)))","v":0},{"$f":"((LCC!$S$19*(LCC!$S$21/100))*(LCC!$S$22*(1+J$15)))","v":0},{"$f":"((LCC!$S$19*(LCC!$S$21/100))*(LCC!$S$22*(1+K$15)))","v":0},{"$f":"((LCC!$S$19*(LCC!$S$21/100))*(LCC!$S$22*(1+L$15)))","v":0},{"$f":"((LCC!$S$19*(LCC!$S$21/100))*(LCC!$S$22*(1+M$15)))","v":0},{"$f":"((LCC!$S$19*(LCC!$S$21/100))*(LCC!$S$22*(1+N$15)))","v":0},{"$f":"SUM(Y47:INDEX(Y47:AI47,LCC!$E$6))","v":0},null,null,{"$f":"((LCC!$S$19*(LCC!$S$25/100))*LCC!$S$26)","v":0},{"$f":"((LCC!$S$19*(LCC!$S$25/100))*(LCC!$S$26*(1+$E$15)))","v":0},{"$f":"((LCC!$S$19*(LCC!$S$25/100))*(LCC!$S$26*(1+$F$15)))","v":0},{"$f":"((LCC!$S$19*(LCC!$S$25/100))*(LCC!$S$26*(1+$G$15)))","v":0},{"$f":"((LCC!$S$19*(LCC!$S$25/100))*(LCC!$S$26*(1+$H$15)))","v":0},{"$f":"((LCC!$S$19*(LCC!$S$25/100))*(LCC!$S$26*(1+$I$15)))","v":0},{"$f":"((LCC!$S$19*(LCC!$S$25/100))*(LCC!$S$26*(1+$J$15)))","v":0},{"$f":"((LCC!$S$19*(LCC!$S$25/100))*(LCC!$S$26*(1+$K$15)))","v":0},{"$f":"((LCC!$S$19*(LCC!$S$25/100))*(LCC!$S$26*(1+$L$15)))","v":0},{"$f":"((LCC!$S$19*(LCC!$S$25/100))*(LCC!$S$26*(1+$M$15)))","v":0},{"$f":"((LCC!$S$19*(LCC!$S$25/100))*(LCC!$S$26*(1+$N$15)))","v":0}]
[null,null,null,null,null,null,null,null,null,null,null,null,null,null,null,null,null,null,null,null,null,null,null,"prodotto 9",{"$f":"((LCC!$U$19*(LCC!$U$21/100))*LCC!$U$22)","v":0},{"$f":"((LCC!$U$19*(LCC!$U$21/100))*(LCC!$U$22*(1+$E$15)))","v":0},{"$f":"((LCC!$U$19*(LCC!$U$21/100))*(LCC!$U$22*(1+$F$15)))","v":0},{"$f":"((LCC!$U$19*(LCC!$U$21/100))*(LCC!$U$22*(1+G$15)))","v":0},{"$f":"((LCC!$U$19*(LCC!$U$21/100))*(LCC!$U$22*(1+H$15)))","v":0},{"$f":"((LCC!$U$19*(LCC!$U$21/100))*(LCC!$U$22*(1+I$15)))","v":0},{"$f":"((LCC!$U$19*(LCC!$U$21/100))*(LCC!$U$22*(1+J$15)))","v":0},{"$f":"((LCC!$U$19*(LCC!$U$21/100))*(LCC!$U$22*(1+K$15)))","v":0},{"$f":"((LCC!$U$19*(LCC!$U$21/100))*(LCC!$U$22*(1+L$15)))","v":0},{"$f":"((LCC!$U$19*(LCC!$U$21/100))*(LCC!$U$22*(1+M$15)))","v":0},{"$f":"((LCC!$U$19*(LCC!$U$21/100))*(LCC!$U$22*(1+N$15)))","v":0},{"$f":"SUM(Y48:INDEX(Y48:AI48,LCC!$E$6))","v":0},null,"ELECTRICITY",{"$f":"((LCC!$U$19*(LCC!$U$25/100))*LCC!$U$26)","v":0},{"$f":"((LCC!$U$19*(LCC!$U$25/100))*(LCC!$U$26*(1+$E$15)))","v":0},{"$f":"((LCC!$U$19*(LCC!$U$25/100))*(LCC!$U$26*(1+$F$15)))","v":0},{"$f":"((LCC!$U$19*(LCC!$U$25/100))*(LCC!$U$26*(1+$G$15)))","v":0},{"$f":"((LCC!$U$19*(LCC!$U$25/100))*(LCC!$U$26*(1+$H$15)))","v":0},{"$f":"((LCC!$U$19*(LCC!$U$25/100))*(LCC!$U$26*(1+$I$15)))","v":0},{"$f":"((LCC!$U$19*(LCC!$U$25/100))*(LCC!$U$26*(1+$J$15)))","v":0},{"$f":"((LCC!$U$19*(LCC!$U$25/100))*(LCC!$U$26*(1+$K$15)))","v":0},{"$f":"((LCC!$U$19*(LCC!$U$25/100))*(LCC!$U$26*(1+$L$15)))","v":0},{"$f":"((LCC!$U$19*(LCC!$U$25/100))*(LCC!$U$26*(1+$M$15)))","v":0},{"$f":"((LCC!$U$19*(LCC!$U$25/100))*(LCC!$U$26*(1+$N$15)))","v":0},"prezzo totale carburante per il periodo"]
[null,null,null,null,null,null,null,null,null,null,null,null,null,null,null,null,null,null,null,null,null,null,null,"prodotto 10",{"$f":"((LCC!$W$19*(LCC!$W$21/100))*LCC!$W$22)","v":0},{"$f":"((LCC!$W$19*(LCC!$W$21/100))*(LCC!$W$22*(1+$E$15)))","v":0},{"$f":"((LCC!$W$19*(LCC!$W$21/100))*(LCC!$W$22*(1+$F$15)))","v":0},{"$f":"((LCC!$W$19*(LCC!$W$21/100))*(LCC!$W$22*(1+G$15)))","v":0},{"$f":"((LCC!$W$19*(LCC!$W$21/100))*(LCC!$W$22*(1+H$15)))","v":0},{"$f":"((LCC!$W$19*(LCC!$W$21/100))*(LCC!$W$22*(1+I$15)))","v":0},{"$f":"((LCC!$W$19*(LCC!$W$21/100))*(LCC!$W$22*(1+J$15)))","v":0},{"$f":"((LCC!$W$19*(LCC!$W$21/100))*(LCC!$W$22*(1+K$15)))","v":0},{"$f":"((LCC!$W$19*(LCC!$W$21/100))*(LCC!$W$22*(1+L$15)))","v":0},{"$f":"((LCC!$W$19*(LCC!$W$21/100))*(LCC!$W$22*(1+M$15)))","v":0},{"$f":"((LCC!$W$19*(LCC!$W$21/100))*(LCC!$W$22*(1+N$15)))","v":0},{"$f":"SUM(Y49:INDEX(Y49:AI49,LCC!$E$6))","v":0},null,"prodotto 1",{"$f":"((LCC!$W$19*(LCC!$W$25/100))*LCC!$W$26)","v":0},{"$f":"((LCC!$W$19*(LCC!$W$25/100))*(LCC!$W$26*(1+$E$15)))","v":0},{"$f":"((LCC!$W$19*(LCC!$W$25/100))*(LCC!$W$26*(1+$F$15)))","v":0},{"$f":"((LCC!$W$19*(LCC!$W$25/100))*(LCC!$W$26*(1+$G$15)))","v":0},{"$f":"((LCC!$W$19*(LCC!$W$25/100))*(LCC!$W$26*(1+$H$15)))","v":0},{"$f":"((LCC!$W$19*(LCC!$W$25/100))*(LCC!$W$26*(1+$I$15)))","v":0},{"$f":"((LCC!$W$19*(LCC!$W$25/100))*(LCC!$W$26*(1+$J$15)))","v":0},{"$f":"((LCC!$W$19*(LCC!$W$25/100))*(LCC!$W$26*(1+$K$15)))","v":0},{"$f":"((LCC!$W$19*(LCC!$W$25/100))*(LCC!$W$26*(1+$L$15)))","v":0},{"$f":"((LCC!$W$19*(LCC!$W$25/100))*(LCC!$W$26*(1+$M$15)))","v":0},{"$f":"((LCC!$W$19*(LCC!$W$25/100))*(LCC!$W$26*(1+$N$15)))","v":0},{"$f":"SUM(AM49:INDEX(AM49:AW49,LCC!$E$6))","v":0}]
[null,null,null,null,null,null,null,null,null,null,null,null,null,null,null,null,null,null,null,null,null,null,null,null,null,null,null,null,null,null,null,null,null,null,null,null,null,"prodotto 2",null,null,null,null,null,null,null,null,null,null,null,{"$f":"SUM(AM50:INDEX(AM50:AW50,LCC!$E$6))","v":0}]
[null,null,null,null,null,null,null,null,null,null,null,null,null,null,null,null,null,null,null,null,null,null,null,"ELECTRICITY",2014,2015,2016,2017,2018,2019,2020,2021,2022,2023,2024,"Total fuel price for period",null,"prodotto 3",2014,2015,2016,2017,2018,2019,2020,2021,2022,2023,2024,{"$f":"SUM(AM51:INDEX(AM51:AW51,LCC!$E$6))","v":22209}]
[null,null,null,null,null,null,null,null,null,null,null,null,null,null,null,null,null,null,null,null,null,null,null,"prodotto 1",{"$f":"((LCC!$E$19*(LCC!$E$21/100))*LCC!$E$22)","v":0},{"$f":"((LCC!$E$19*(LCC!$E$21/100))*(LCC!$E$22*(1+$E$18)))","v":0},{"$f":"((LCC!$E$19*(LCC!$E$21/100))*(LCC!$E$22*(1+$F$18)))","v":0},{"$f":"((LCC!$E$19*(LCC!$E$21/100))*(LCC!$E$22*(1+G$18)))","v":0},{"$f":"((LCC!$E$19*(LCC!$E$21/100))*(LCC!$E$22*(1+H$18)))","v":0},{"$f":"((LCC!$E$19*(LCC!$E$21/100))*(LCC!$E$22*(1+I$18)))","v":0},{"$f":"((LCC!$E$19*(LCC!$E$21/100))*(LCC!$E$22*(1+J$18)))","v":0},{"$f":"((LCC!$E$19*(LCC!$E$21/100))*(LCC!$E$22*(1+K$18)))","v":0},{"$f":"((LCC!$E$19*(LCC!$E$21/100))*(LCC!$E$22*(1+L$18)))","v":0},{"$f":"((LCC!$E$19*(LCC!$E$21/100))*(LCC!$E$22*(1+M$18)))","v":0},{"$f":"((LCC!$E$19*(LCC!$E$21/100))*(LCC!$E$22*(1+N$18)))","v":0},{"$f":"SUM(Y52:INDEX(Y52:AI52,LCC!$E$6))","v":0},null,"prodotto 4",{"$f":"((LCC!$E$19*(LCC!$E$25/100))*LCC!$E$26)","v":0},{"$f":"((LCC!$E$19*(LCC!$E$25/100))*(LCC!$E$26*(1+$E$18)))","v":0},{"$f":"((LCC!$E$19*(LCC!$E$25/100))*(LCC!$E$26*(1+$F$18)))","v":0},{"$f":"((LCC!$E$19*(LCC!$E$25/100))*(LCC!$E$26*(1+$G$18)))","v":0},{"$f":"((LCC!$E$19*(LCC!$E$25/100))*(LCC!$E$26*(1+$H$18)))","v":0},{"$f":"((LCC!$E$19*(LCC!$E$25/100))*(LCC!$E$26*(1+$I$18)))","v":0},{"$f":"((LCC!$E$19*(LCC!$E$25/100))*(LCC!$E$26*(1+$J$18)))","v":0},{"$f":"((LCC!$E$19*(LCC!$E$25/100))*(LCC!$E$26*(1+$K$18)))","v":0},{"$f":"((LCC!$E$19*(LCC!$E$25/100))*(LCC!$E$26*(1+$L$18)))","v":0},{"$f":"((LCC!$E$19*(LCC!$E$25/100))*(LCC!$E$26*(1+$M$18)))","v":0},{"$f":"((LCC!$E$19*(LCC!$E$25/100))*(LCC!$E$26*(1+$N$18)))","v":0},{"$f":"SUM(AM52:INDEX(AM52:AW52,LCC!$E$6))","v":0}]
[null,null,null,null,null,null,null,null,null,null,null,null,null,null,null,null,null,null,null,null,null,null,null,"prodotto 2",{"$f":"((LCC!$G$19*(LCC!$G$21/100))*LCC!$G$22)","v":0},{"$f":"((LCC!$G$19*(LCC!$G$21/100))*(LCC!$G$22*(1+$E$18)))","v":0},{"$f":"((LCC!$G$19*(LCC!$G$21/100))*(LCC!$G$22*(1+$F$18)))","v":0},{"$f":"((LCC!$G$19*(LCC!$G$21/100))*(LCC!$G$22*(1+G$18)))","v":0},{"$f":"((LCC!$G$19*(LCC!$G$21/100))*(LCC!$G$22*(1+H$18)))","v":0},{"$f":"((LCC!$G$19*(LCC!$G$21/100))*(LCC!$G$22*(1+I$18)))","v":0},{"$f":"((LCC!$G$19*(LCC!$G$21/100))*(LCC!$G$22*(1+J$18)))","v":0},{"$f":"((LCC!$G$19*(LCC!$G$21/100))*(LCC!$G$22*(1+K$18)))","v":0},{"$f":"((LCC!$G$19*(LCC!$G$21/100))*(LCC!$G$22*(1+L$18)))","v":0},{"$f":"((LCC!$G$19*(LCC!$G$21/100))*(LCC!$G$22*(1+M$18)))","v":0},{"$f":"((LCC!$G$19*(LCC!$G$21/100))*(LCC!$G$22*(1+N$18)))","v":0},{"$f":"SUM(Y53:INDEX(Y53:AI53,LCC!$E$6))","v":0},null,"prodotto 5",{"$f":"((LCC!$G$19*(LCC!$G$25/100))*LCC!$G$26)","v":0},{"$f":"((LCC!$G$19*(LCC!$G$25/100))*(LCC!$G$26*(1+$E$18)))","v":0},{"$f":"((LCC!$G$19*(LCC!$G$25/100))*(LCC!$G$26*(1+$F$18)))","v":0},{"$f":"((LCC!$G$19*(LCC!$G$25/100))*(LCC!$G$26*(1+$G$18)))","v":0},{"$f":"((LCC!$G$19*(LCC!$G$25/100))*(LCC!$G$26*(1+$H$18)))","v":0},{"$f":"((LCC!$G$19*(LCC!$G$25/100))*(LCC!$G$26*(1+$I$18)))","v":0},{"$f":"((LCC!$G$19*(LCC!$G$25/100))*(LCC!$G$26*(1+$J$18)))","v":0},{"$f":"((LCC!$G$19*(LCC!$G$25/100))*(LCC!$G$26*(1+$K$18)))","v":0},{"$f":"((LCC!$G$19*(LCC!$G$25/100))*(LCC!$G$26*(1+$L$18)))","v":0},{"$f":"((LCC!$G$19*(LCC!$G$25/100))*(LCC!$G$26*(1+$M$18)))","v":0},{"$f":"((LCC!$G$19*(LCC!$G$25/100))*(LCC!$G$26*(1+$N$18)))","v":0},{"$f":"SUM(AM53:INDEX(AM53:AW53,LCC!$E$6))","v":0}]
[null,null,null,null,null,null,null,null,null,null,null,null,null,null,null,null,null,null,null,null,null,null,null,"prodotto 3",{"$f":"((LCC!$I$19*(LCC!$I$21/100))*LCC!$I$22)","v":0},{"$f":"((LCC!$I$19*(LCC!$I$21/100))*(LCC!$I$22*(1+$E$18)))","v":0},{"$f":"((LCC!$I$19*(LCC!$I$21/100))*(LCC!$I$22*(1+$F$18)))","v":0},{"$f":"((LCC!$I$19*(LCC!$I$21/100))*(LCC!$I$22*(1+G$18)))","v":0},{"$f":"((LCC!$I$19*(LCC!$I$21/100))*(LCC!$I$22*(1+H$18)))","v":0},{"$f":"((LCC!$I$19*(LCC!$I$21/100))*(LCC!$I$22*(1+I$18)))","v":0},{"$f":"((LCC!$I$19*(LCC!$I$21/100))*(LCC!$I$22*(1+J$18)))","v":0},{"$f":"((LCC!$I$19*(LCC!$I$21/100))*(LCC!$I$22*(1+K$18)))","v":0},{"$f":"((LCC!$I$19*(LCC!$I$21/100))*(LCC!$I$22*(1+L$18)))","v":0},{"$f":"((LCC!$I$19*(LCC!$I$21/100))*(LCC!$I$22*(1+M$18)))","v":0},{"$f":"((LCC!$I$19*(LCC!$I$21/100))*(LCC!$I$22*(1+N$18)))","v":0},{"$f":"SUM(Y54:INDEX(Y54:AI54,LCC!$E$6))","v":0},null,"prodotto 6",{"$f":"((LCC!$I$19*(LCC!$I$25/100))*LCC!$I$26)","v":0},{"$f":"((LCC!$I$19*(LCC!$I$25/100))*(LCC!$I$26*(1+$E$18)))","v":0},{"$f":"((LCC!$I$19*(LCC!$I$25/100))*(LCC!$I$26*(1+$F$18)))","v":0},{"$f":"((LCC!$I$19*(LCC!$I$25/100))*(LCC!$I$26*(1+$G$18)))","v":0},{"$f":"((LCC!$I$19*(LCC!$I$25/100))*(LCC!$I$26*(1+$H$18)))","v":0},{"$f":"((LCC!$I$19*(LCC!$I$25/100))*(LCC!$I$26*(1+$I$18)))","v":0},{"$f":"((LCC!$I$19*(LCC!$I$25/100))*(LCC!$I$26*(1+$J$18)))","v":0},{"$f":"((LCC!$I$19*(LCC!$I$25/100))*(LCC!$I$26*(1+$K$18)))","v":0},{"$f":"((LCC!$I$19*(LCC!$I$25/100))*(LCC!$I$26*(1+$L$18)))","v":0},{"$f":"((LCC!$I$19*(LCC!$I$25/100))*(LCC!$I$26*(1+$M$18)))","v":0},{"$f":"((LCC!$I$19*(LCC!$I$25/100))*(LCC!$I$26*(1+$N$18)))","v":0},{"$f":"SUM(AM54:INDEX(AM54:AW54,LCC!$E$6))","v":0}]
[null,null,null,null,null,null,null,null,null,null,null,null,null,null,null,null,null,null,null,null,null,null,null,"prodotto 4",{"$f":"((LCC!$K$19*(LCC!$K$21/100))*LCC!$K$22)","v":0},{"$f":"((LCC!$K$19*(LCC!$K$21/100))*(LCC!$K$22*(1+$E$18)))","v":0},{"$f":"((LCC!$K$19*(LCC!$K$21/100))*(LCC!$K$22*(1+$F$18)))","v":0},{"$f":"((LCC!$K$19*(LCC!$K$21/100))*(LCC!$K$22*(1+G$18)))","v":0},{"$f":"((LCC!$K$19*(LCC!$K$21/100))*(LCC!$K$22*(1+H$18)))","v":0},{"$f":"((LCC!$K$19*(LCC!$K$21/100))*(LCC!$K$22*(1+I$18)))","v":0},{"$f":"((LCC!$K$19*(LCC!$K$21/100))*(LCC!$K$22*(1+J$18)))","v":0},{"$f":"((LCC!$K$19*(LCC!$K$21/100))*(LCC!$K$22*(1+K$18)))","v":0},{"$f":"((LCC!$K$19*(LCC!$K$21/100))*(LCC!$K$22*(1+L$18)))","v":0},{"$f":"((LCC!$K$19*(LCC!$K$21/100))*(LCC!$K$22*(1+M$18)))","v":0},{"$f":"((LCC!$K$19*(LCC!$K$21/100))*(LCC!$K$22*(1+N$18)))","v":0},{"$f":"SUM(Y55:INDEX(Y55:AI55,LCC!$E$6))","v":0},null,"prodotto 7",{"$f":"((LCC!$K$19*(LCC!$K$25/100))*LCC!$K$26)","v":0},{"$f":"((LCC!$K$19*(LCC!$K$25/100))*(LCC!$K$26*(1+$E$18)))","v":0},{"$f":"((LCC!$K$19*(LCC!$K$25/100))*(LCC!$K$26*(1+$F$18)))","v":0},{"$f":"((LCC!$K$19*(LCC!$K$25/100))*(LCC!$K$26*(1+$G$18)))","v":0},{"$f":"((LCC!$K$19*(LCC!$K$25/100))*(LCC!$K$26*(1+$H$18)))","v":0},{"$f":"((LCC!$K$19*(LCC!$K$25/100))*(LCC!$K$26*(1+$I$18)))","v":0},{"$f":"((LCC!$K$19*(LCC!$K$25/100))*(LCC!$K$26*(1+$J$18)))","v":0},{"$f":"((LCC!$K$19*(LCC!$K$25/100))*(LCC!$K$26*(1+$K$18)))","v":0},{"$f":"((LCC!$K$19*(LCC!$K$25/100))*(LCC!$K$26*(1+$L$18)))","v":0},{"$f":"((LCC!$K$19*(LCC!$K$25/100))*(LCC!$K$26*(1+$M$18)))","v":0},{"$f":"((LCC!$K$19*(LCC!$K$25/100))*(LCC!$K$26*(1+$N$18)))","v":0},{"$f":"SUM(AM55:INDEX(AM55:AW55,LCC!$E$6))","v":0}]
[null,null,null,null,null,null,null,null,null,null,null,null,null,null,null,null,null,null,null,null,null,null,null,"prodotto 5",{"$f":"((LCC!$M$19*(LCC!$M$21/100))*LCC!$M$22)","v":0},{"$f":"((LCC!$M$19*(LCC!$M$21/100))*(LCC!$M$22*(1+$E$18)))","v":0},{"$f":"((LCC!$M$19*(LCC!$M$21/100))*(LCC!$M$22*(1+$F$18)))","v":0},{"$f":"((LCC!$M$19*(LCC!$M$21/100))*(LCC!$M$22*(1+G$18)))","v":0},{"$f":"((LCC!$M$19*(LCC!$M$21/100))*(LCC!$M$22*(1+H$18)))","v":0},{"$f":"((LCC!$M$19*(LCC!$M$21/100))*(LCC!$M$22*(1+I$18)))","v":0},{"$f":"((LCC!$M$19*(LCC!$M$21/100))*(LCC!$M$22*(1+J$18)))","v":0},{"$f":"((LCC!$M$19*(LCC!$M$21/100))*(LCC!$M$22*(1+K$18)))","v":0},{"$f":"((LCC!$M$19*(LCC!$M$21/100))*(LCC!$M$22*(1+L$18)))","v":0},{"$f":"((LCC!$M$19*(LCC!$M$21/100))*(LCC!$M$22*(1+M$18)))","v":0},{"$f":"((LCC!$M$19*(LCC!$M$21/100))*(LCC!$M$22*(1+N$18)))","v":0},{"$f":"SUM(Y56:INDEX(Y56:AI56,LCC!$E$6))","v":0},null,"prodotto 8",{"$f":"((LCC!$M$19*(LCC!$M$25/100))*LCC!$M$26)","v":0},{"$f":"((LCC!$M$19*(LCC!$M$25/100))*(LCC!$M$26*(1+$E$18)))","v":0},{"$f":"((LCC!$M$19*(LCC!$M$25/100))*(LCC!$M$26*(1+$F$18)))","v":0},{"$f":"((LCC!$M$19*(LCC!$M$25/100))*(LCC!$M$26*(1+$G$18)))","v":0},{"$f":"((LCC!$M$19*(LCC!$M$25/100))*(LCC!$M$26*(1+$H$18)))","v":0},{"$f":"((LCC!$M$19*(LCC!$M$25/100))*(LCC!$M$26*(1+$I$18)))","v":0},{"$f":"((LCC!$M$19*(LCC!$M$25/100))*(LCC!$M$26*(1+$J$18)))","v":0},{"$f":"((LCC!$M$19*(LCC!$M$25/100))*(LCC!$M$26*(1+$K$18)))","v":0},{"$f":"((LCC!$M$19*(LCC!$M$25/100))*(LCC!$M$26*(1+$L$18)))","v":0},{"$f":"((LCC!$M$19*(LCC!$M$25/100))*(LCC!$M$26*(1+$M$18)))","v":0},{"$f":"((LCC!$M$19*(LCC!$M$25/100))*(LCC!$M$26*(1+$N$18)))","v":0},{"$f":"SUM(AM56:INDEX(AM56:AW56,LCC!$E$6))","v":0}]
[null,null,null,null,null,null,null,null,null,null,null,null,null,null,null,null,null,null,null,null,null,null,null,"prodotto 6",{"$f":"((LCC!$O$19*(LCC!$O$21/100))*LCC!$O$22)","v":0},{"$f":"((LCC!$O$19*(LCC!$O$21/100))*(LCC!$O$22*(1+$E$18)))","v":0},{"$f":"((LCC!$O$19*(LCC!$O$21/100))*(LCC!$O$22*(1+$F$18)))","v":0},{"$f":"((LCC!$O$19*(LCC!$O$21/100))*(LCC!$O$22*(1+G$18)))","v":0},{"$f":"((LCC!$O$19*(LCC!$O$21/100))*(LCC!$O$22*(1+H$18)))","v":0},{"$f":"((LCC!$O$19*(LCC!$O$21/100))*(LCC!$O$22*(1+I$18)))","v":0},{"$f":"((LCC!$O$19*(LCC!$O$21/100))*(LCC!$O$22*(1+J$18)))","v":0},{"$f":"((LCC!$O$19*(LCC!$O$21/100))*(LCC!$O$22*(1+K$18)))","v":0},{"$f":"((LCC!$O$19*(LCC!$O$21/100))*(LCC!$O$22*(1+L$18)))","v":0},{"$f":"((LCC!$O$19*(LCC!$O$21/100))*(LCC!$O$22*(1+M$18)))","v":0},{"$f":"((LCC!$O$19*(LCC!$O$21/100))*(LCC!$O$22*(1+N$18)))","v":0},{"$f":"SUM(Y57:INDEX(Y57:AI57,LCC!$E$6))","v":0},null,"prodotto 9",{"$f":"((LCC!$O$19*(LCC!$O$25/100))*LCC!$O$26)","v":0},{"$f":"((LCC!$O$19*(LCC!$O$25/100))*(LCC!$O$26*(1+$E$18)))","v":0},{"$f":"((LCC!$O$19*(LCC!$O$25/100))*(LCC!$O$26*(1+$F$18)))","v":0},{"$f":"((LCC!$O$19*(LCC!$O$25/100))*(LCC!$O$26*(1+$G$18)))","v":0},{"$f":"((LCC!$O$19*(LCC!$O$25/100))*(LCC!$O$26*(1+$H$18)))","v":0},{"$f":"((LCC!$O$19*(LCC!$O$25/100))*(LCC!$O$26*(1+$I$18)))","v":0},{"$f":"((LCC!$O$19*(LCC!$O$25/100))*(LCC!$O$26*(1+$J$18)))","v":0},{"$f":"((LCC!$O$19*(LCC!$O$25/100))*(LCC!$O$26*(1+$K$18)))","v":0},{"$f":"((LCC!$O$19*(LCC!$O$25/100))*(LCC!$O$26*(1+$L$18)))","v":0},{"$f":"((LCC!$O$19*(LCC!$O$25/100))*(LCC!$O$26*(1+$M$18)))","v":0},{"$f":"((LCC!$O$19*(LCC!$O$25/100))*(LCC!$O$26*(1+$N$18)))","v":0},{"$f":"SUM(AM57:INDEX(AM57:AW57,LCC!$E$6))","v":0}]
[null,null,null,null,null,null,null,null,null,null,null,null,null,null,null,null,null,null,null,null,null,null,null,"prodotto 7",{"$f":"((LCC!$Q$19*(LCC!$Q$21/100))*LCC!$Q$22)","v":0},{"$f":"((LCC!$Q$19*(LCC!$Q$21/100))*(LCC!$Q$22*(1+$E$18)))","v":0},{"$f":"((LCC!$Q$19*(LCC!$Q$21/100))*(LCC!$Q$22*(1+$F$18)))","v":0},{"$f":"((LCC!$Q$19*(LCC!$Q$21/100))*(LCC!$Q$22*(1+G$18)))","v":0},{"$f":"((LCC!$Q$19*(LCC!$Q$21/100))*(LCC!$Q$22*(1+H$18)))","v":0},{"$f":"((LCC!$Q$19*(LCC!$Q$21/100))*(LCC!$Q$22*(1+I$18)))","v":0},{"$f":"((LCC!$Q$19*(LCC!$Q$21/100))*(LCC!$Q$22*(1+J$18)))","v":0},{"$f":"((LCC!$Q$19*(LCC!$Q$21/100))*(LCC!$Q$22*(1+K$18)))","v":0},{"$f":"((LCC!$Q$19*(LCC!$Q$21/100))*(LCC!$Q$22*(1+L$18)))","v":0},{"$f":"((LCC!$Q$19*(LCC!$Q$21/100))*(LCC!$Q$22*(1+M$18)))","v":0},{"$f":"((LCC!$Q$19*(LCC!$Q$21/100))*(LCC!$Q$22*(1+N$18)))","v":0},{"$f":"SUM(Y58:INDEX(Y58:AI58,LCC!$E$6))","v":0},null,"prodotto 10",{"$f":"((LCC!$Q$19*(LCC!$Q$25/100))*LCC!$Q$26)","v":0},{"$f":"((LCC!$Q$19*(LCC!$Q$25/100))*(LCC!$Q$26*(1+$E$18)))","v":0},{"$f":"((LCC!$Q$19*(LCC!$Q$25/100))*(LCC!$Q$26*(1+$F$18)))","v":0},{"$f":"((LCC!$Q$19*(LCC!$Q$25/100))*(LCC!$Q$26*(1+$G$18)))","v":0},{"$f":"((LCC!$Q$19*(LCC!$Q$25/100))*(LCC!$Q$26*(1+$H$18)))","v":0},{"$f":"((LCC!$Q$19*(LCC!$Q$25/100))*(LCC!$Q$26*(1+$I$18)))","v":0},{"$f":"((LCC!$Q$19*(LCC!$Q$25/100))*(LCC!$Q$26*(1+$J$18)))","v":0},{"$f":"((LCC!$Q$19*(LCC!$Q$25/100))*(LCC!$Q$26*(1+$K$18)))","v":0},{"$f":"((LCC!$Q$19*(LCC!$Q$25/100))*(LCC!$Q$26*(1+$L$18)))","v":0},{"$f":"((LCC!$Q$19*(LCC!$Q$25/100))*(LCC!$Q$26*(1+$M$18)))","v":0},{"$f":"((LCC!$Q$19*(LCC!$Q$25/100))*(LCC!$Q$26*(1+$N$18)))","v":0},{"$f":"SUM(AM58:INDEX(AM58:AW58,LCC!$E$6))","v":0}]
[null,null,null,null,null,null,null,null,null,null,null,null,null,null,null,null,null,null,null,null,null,null,null,"prodotto 8",{"$f":"((LCC!$S$19*(LCC!$S$21/100))*LCC!$S$22)","v":0},{"$f":"((LCC!$S$19*(LCC!$S$21/100))*(LCC!$S$22*(1+$E$18)))","v":0},{"$f":"((LCC!$S$19*(LCC!$S$21/100))*(LCC!$S$22*(1+$F$18)))","v":0},{"$f":"((LCC!$S$19*(LCC!$S$21/100))*(LCC!$S$22*(1+G$18)))","v":0},{"$f":"((LCC!$S$19*(LCC!$S$21/100))*(LCC!$S$22*(1+H$18)))","v":0},{"$f":"((LCC!$S$19*(LCC!$S$21/100))*(LCC!$S$22*(1+I$18)))","v":0},{"$f":"((LCC!$S$19*(LCC!$S$21/100))*(LCC!$S$22*(1+J$18)))","v":0},{"$f":"((LCC!$S$19*(LCC!$S$21/100))*(LCC!$S$22*(1+K$18)))","v":0},{"$f":"((LCC!$S$19*(LCC!$S$21/100))*(LCC!$S$22*(1+L$18)))","v":0},{"$f":"((LCC!$S$19*(LCC!$S$21/100))*(LCC!$S$22*(1+M$18)))","v":0},{"$f":"((LCC!$S$19*(LCC!$S$21/100))*(LCC!$S$22*(1+N$18)))","v":0},{"$f":"SUM(Y59:INDEX(Y59:AI59,LCC!$E$6))","v":0},null,null,{"$f":"((LCC!$S$19*(LCC!$S$25/100))*LCC!$S$26)","v":0},{"$f":"((LCC!$S$19*(LCC!$S$25/100))*(LCC!$S$26*(1+$E$18)))","v":0},{"$f":"((LCC!$S$19*(LCC!$S$25/100))*(LCC!$S$26*(1+$F$18)))","v":0},{"$f":"((LCC!$S$19*(LCC!$S$25/100))*(LCC!$S$26*(1+$G$18)))","v":0},{"$f":"((LCC!$S$19*(LCC!$S$25/100))*(LCC!$S$26*(1+$H$18)))","v":0},{"$f":"((LCC!$S$19*(LCC!$S$25/100))*(LCC!$S$26*(1+$I$18)))","v":0},{"$f":"((LCC!$S$19*(LCC!$S$25/100))*(LCC!$S$26*(1+$J$18)))","v":0},{"$f":"((LCC!$S$19*(LCC!$S$25/100))*(LCC!$S$26*(1+$K$18)))","v":0},{"$f":"((LCC!$S$19*(LCC!$S$25/100))*(LCC!$S$26*(1+$L$18)))","v":0},{"$f":"((LCC!$S$19*(LCC!$S$25/100))*(LCC!$S$26*(1+$M$18)))","v":0},{"$f":"((LCC!$S$19*(LCC!$S$25/100))*(LCC!$S$26*(1+$N$18)))","v":0}]
[null,null,null,null,null,null,null,null,null,null,null,null,null,null,null,null,null,null,null,null,null,null,null,"prodotto 9",{"$f":"((LCC!$U$19*(LCC!$U$21/100))*LCC!$U$22)","v":0},{"$f":"((LCC!$U$19*(LCC!$U$21/100))*(LCC!$U$22*(1+$E$18)))","v":0},{"$f":"((LCC!$U$19*(LCC!$U$21/100))*(LCC!$U$22*(1+$F$18)))","v":0},{"$f":"((LCC!$U$19*(LCC!$U$21/100))*(LCC!$U$22*(1+G$18)))","v":0},{"$f":"((LCC!$U$19*(LCC!$U$21/100))*(LCC!$U$22*(1+H$18)))","v":0},{"$f":"((LCC!$U$19*(LCC!$U$21/100))*(LCC!$U$22*(1+I$18)))","v":0},{"$f":"((LCC!$U$19*(LCC!$U$21/100))*(LCC!$U$22*(1+J$18)))","v":0},{"$f":"((LCC!$U$19*(LCC!$U$21/100))*(LCC!$U$22*(1+K$18)))","v":0},{"$f":"((LCC!$U$19*(LCC!$U$21/100))*(LCC!$U$22*(1+L$18)))","v":0},{"$f":"((LCC!$U$19*(LCC!$U$21/100))*(LCC!$U$22*(1+M$18)))","v":0},{"$f":"((LCC!$U$19*(LCC!$U$21/100))*(LCC!$U$22*(1+N$18)))","v":0},{"$f":"SUM(Y60:INDEX(Y60:AI60,LCC!$E$6))","v":0},null,"BIODIESEL",{"$f":"((LCC!$U$19*(LCC!$U$25/100))*LCC!$U$26)","v":0},{"$f":"((LCC!$U$19*(LCC!$U$25/100))*(LCC!$U$26*(1+$E$18)))","v":0},{"$f":"((LCC!$U$19*(LCC!$U$25/100))*(LCC!$U$26*(1+$F$18)))","v":0},{"$f":"((LCC!$U$19*(LCC!$U$25/100))*(LCC!$U$26*(1+$G$18)))","v":0},{"$f":"((LCC!$U$19*(LCC!$U$25/100))*(LCC!$U$26*(1+$H$18)))","v":0},{"$f":"((LCC!$U$19*(LCC!$U$25/100))*(LCC!$U$26*(1+$I$18)))","v":0},{"$f":"((LCC!$U$19*(LCC!$U$25/100))*(LCC!$U$26*(1+$J$18)))","v":0},{"$f":"((LCC!$U$19*(LCC!$U$25/100))*(LCC!$U$26*(1+$K$18)))","v":0},{"$f":"((LCC!$U$19*(LCC!$U$25/100))*(LCC!$U$26*(1+$L$18)))","v":0},{"$f":"((LCC!$U$19*(LCC!$U$25/100))*(LCC!$U$26*(1+$M$18)))","v":0},{"$f":"((LCC!$U$19*(LCC!$U$25/100))*(LCC!$U$26*(1+$N$18)))","v":0},"prezzo totale carburante per il periodo"]
[null,null,null,null,null,null,null,null,null,null,null,null,null,null,null,null,null,null,null,null,null,null,null,"prodotto 10",{"$f":"((LCC!$W$19*(LCC!$W$21/100))*LCC!$W$22)","v":0},{"$f":"((LCC!$W$19*(LCC!$W$21/100))*(LCC!$W$22*(1+$E$18)))","v":0},{"$f":"((LCC!$W$19*(LCC!$W$21/100))*(LCC!$W$22*(1+$F$18)))","v":0},{"$f":"((LCC!$W$19*(LCC!$W$21/100))*(LCC!$W$22*(1+G$18)))","v":0},{"$f":"((LCC!$W$19*(LCC!$W$21/100))*(LCC!$W$22*(1+H$18)))","v":0},{"$f":"((LCC!$W$19*(LCC!$W$21/100))*(LCC!$W$22*(1+I$18)))","v":0},{"$f":"((LCC!$W$19*(LCC!$W$21/100))*(LCC!$W$22*(1+J$18)))","v":0},{"$f":"((LCC!$W$19*(LCC!$W$21/100))*(LCC!$W$22*(1+K$18)))","v":0},{"$f":"((LCC!$W$19*(LCC!$W$21/100))*(LCC!$W$22*(1+L$18)))","v":0},{"$f":"((LCC!$W$19*(LCC!$W$21/100))*(LCC!$W$22*(1+M$18)))","v":0},{"$f":"((LCC!$W$19*(LCC!$W$21/100))*(LCC!$W$22*(1+N$18)))","v":0},{"$f":"SUM(Y61:INDEX(Y61:AI61,LCC!$E$6))","v":0},null,"prodotto 1",{"$f":"((LCC!$W$19*(LCC!$W$25/100))*LCC!$W$26)","v":0},{"$f":"((LCC!$W$19*(LCC!$W$25/100))*(LCC!$W$26*(1+$E$18)))","v":0},{"$f":"((LCC!$W$19*(LCC!$W$25/100))*(LCC!$W$26*(1+$F$18)))","v":0},{"$f":"((LCC!$W$19*(LCC!$W$25/100))*(LCC!$W$26*(1+$G$18)))","v":0},{"$f":"((LCC!$W$19*(LCC!$W$25/100))*(LCC!$W$26*(1+$H$18)))","v":0},{"$f":"((LCC!$W$19*(LCC!$W$25/100))*(LCC!$W$26*(1+$I$18)))","v":0},{"$f":"((LCC!$W$19*(LCC!$W$25/100))*(LCC!$W$26*(1+$J$18)))","v":0},{"$f":"((LCC!$W$19*(LCC!$W$25/100))*(LCC!$W$26*(1+$K$18)))","v":0},{"$f":"((LCC!$W$19*(LCC!$W$25/100))*(LCC!$W$26*(1+$L$18)))","v":0},{"$f":"((LCC!$W$19*(LCC!$W$25/100))*(LCC!$W$26*(1+$M$18)))","v":0},{"$f":"((LCC!$W$19*(LCC!$W$25/100))*(LCC!$W$26*(1+$N$18)))","v":0},{"$f":"SUM(AM61:INDEX(AM61:AW61,LCC!$E$6))","v":0}]
[null,null,null,null,null,null,null,null,null,null,null,null,null,null,null,null,null,null,null,null,null,null,null,null,null,null,null,null,null,null,null,null,null,null,null,null,null,"prodotto 2",null,null,null,null,null,null,null,null,null,null,null,{"$f":"SUM(AM62:INDEX(AM62:AW62,LCC!$E$6))","v":0}]
[null,null,null,null,null,null,null,null,null,null,null,null,null,null,null,null,null,null,null,null,null,null,null,"BIODIESEL",2014,2015,2016,2017,2018,2019,2020,2021,2022,2023,2024,"Total fuel price for period",null,"prodotto 3",2014,2015,2016,2017,2018,2019,2020,2021,2022,2023,2024,{"$f":"SUM(AM63:INDEX(AM63:AW63,LCC!$E$6))","v":22209}]
[null,null,null,null,null,null,null,null,null,null,null,null,null,null,null,null,null,null,null,null,null,null,null,"prodotto 1",{"$f":"((LCC!$E$19*(LCC!$E$21/100))*LCC!$E$22)","v":0},{"$f":"((LCC!$E$19*(LCC!$E$21/100))*(LCC!$E$22*(1+$E$21)))","v":0},{"$f":"((LCC!$E$19*(LCC!$E$21/100))*(LCC!$E$22*(1+$F$21)))","v":0},{"$f":"((LCC!$E$19*(LCC!$E$21/100))*(LCC!$E$22*(1+G$21)))","v":0},{"$f":"((LCC!$E$19*(LCC!$E$21/100))*(LCC!$E$22*(1+H$21)))","v":0},{"$f":"((LCC!$E$19*(LCC!$E$21/100))*(LCC!$E$22*(1+I$21)))","v":0},{"$f":"((LCC!$E$19*(LCC!$E$21/100))*(LCC!$E$22*(1+J$21)))","v":0},{"$f":"((LCC!$E$19*(LCC!$E$21/100))*(LCC!$E$22*(1+K$21)))","v":0},{"$f":"((LCC!$E$19*(LCC!$E$21/100))*(LCC!$E$22*(1+L$21)))","v":0},{"$f":"((LCC!$E$19*(LCC!$E$21/100))*(LCC!$E$22*(1+M$21)))","v":0},{"$f":"((LCC!$E$19*(LCC!$E$21/100))*(LCC!$E$22*(1+N$21)))","v":0},{"$f":"SUM(Y64:INDEX(Y64:AI64,LCC!$E$6))","v":0},null,"prodotto 4",{"$f":"((LCC!$E$19*(LCC!$E$25/100))*LCC!$E$26)","v":0},{"$f":"((LCC!$E$19*(LCC!$E$25/100))*(LCC!$E$26*(1+$E$21)))","v":0},{"$f":"((LCC!$E$19*(LCC!$E$25/100))*(LCC!$E$26*(1+$F$21)))","v":0},{"$f":"((LCC!$E$19*(LCC!$E$25/100))*(LCC!$E$26*(1+$G$21)))","v":0},{"$f":"((LCC!$E$19*(LCC!$E$25/100))*(LCC!$E$26*(1+$H$21)))","v":0},{"$f":"((LCC!$E$19*(LCC!$E$25/100))*(LCC!$E$26*(1+$I$21)))","v":0},{"$f":"((LCC!$E$19*(LCC!$E$25/100))*(LCC!$E$26*(1+$J$21)))","v":0},{"$f":"((LCC!$E$19*(LCC!$E$25/100))*(LCC!$E$26*(1+$K$21)))","v":0},{"$f":"((LCC!$E$19*(LCC!$E$25/100))*(LCC!$E$26*(1+$L$21)))","v":0},{"$f":"((LCC!$E$19*(LCC!$E$25/100))*(LCC!$E$26*(1+$M$21)))","v":0},{"$f":"((LCC!$E$19*(LCC!$E$25/100))*(LCC!$E$26*(1+$N$21)))","v":0},{"$f":"SUM(AM64:INDEX(AM64:AW64,LCC!$E$6))","v":0}]
[null,null,null,null,null,null,null,null,null,null,null,null,null,null,null,null,null,null,null,null,null,null,null,"prodotto 2",{"$f":"((LCC!$G$19*(LCC!$G$21/100))*LCC!$G$22)","v":0},{"$f":"((LCC!$G$19*(LCC!$G$21/100))*(LCC!$G$22*(1+$E$21)))","v":0},{"$f":"((LCC!$G$19*(LCC!$G$21/100))*(LCC!$G$22*(1+$F$21)))","v":0},{"$f":"((LCC!$G$19*(LCC!$G$21/100))*(LCC!$G$22*(1+G$21)))","v":0},{"$f":"((LCC!$G$19*(LCC!$G$21/100))*(LCC!$G$22*(1+H$21)))","v":0},{"$f":"((LCC!$G$19*(LCC!$G$21/100))*(LCC!$G$22*(1+I$21)))","v":0},{"$f":"((LCC!$G$19*(LCC!$G$21/100))*(LCC!$G$22*(1+J$21)))","v":0},{"$f":"((LCC!$G$19*(LCC!$G$21/100))*(LCC!$G$22*(1+K$21)))","v":0},{"$f":"((LCC!$G$19*(LCC!$G$21/100))*(LCC!$G$22*(1+L$21)))","v":0},{"$f":"((LCC!$G$19*(LCC!$G$21/100))*(LCC!$G$22*(1+M$21)))","v":0},{"$f":"((LCC!$G$19*(LCC!$G$21/100))*(LCC!$G$22*(1+N$21)))","v":0},{"$f":"SUM(Y65:INDEX(Y65:AI65,LCC!$E$6))","v":0},null,"prodotto 5",{"$f":"((LCC!$G$19*(LCC!$G$25/100))*LCC!$G$26)","v":0},{"$f":"((LCC!$G$19*(LCC!$G$25/100))*(LCC!$G$26*(1+$E$21)))","v":0},{"$f":"((LCC!$G$19*(LCC!$G$25/100))*(LCC!$G$26*(1+$F$21)))","v":0},{"$f":"((LCC!$G$19*(LCC!$G$25/100))*(LCC!$G$26*(1+$G$21)))","v":0},{"$f":"((LCC!$G$19*(LCC!$G$25/100))*(LCC!$G$26*(1+$H$21)))","v":0},{"$f":"((LCC!$G$19*(LCC!$G$25/100))*(LCC!$G$26*(1+$I$21)))","v":0},{"$f":"((LCC!$G$19*(LCC!$G$25/100))*(LCC!$G$26*(1+$J$21)))","v":0},{"$f":"((LCC!$G$19*(LCC!$G$25/100))*(LCC!$G$26*(1+$K$21)))","v":0},{"$f":"((LCC!$G$19*(LCC!$G$25/100))*(LCC!$G$26*(1+$L$21)))","v":0},{"$f":"((LCC!$G$19*(LCC!$G$25/100))*(LCC!$G$26*(1+$M$21)))","v":0},{"$f":"((LCC!$G$19*(LCC!$G$25/100))*(LCC!$G$26*(1+$N$21)))","v":0},{"$f":"SUM(AM65:INDEX(AM65:AW65,LCC!$E$6))","v":0}]
[null,null,null,null,null,null,null,null,null,null,null,null,null,null,null,null,null,null,null,null,null,null,null,"prodotto 3",{"$f":"((LCC!$I$19*(LCC!$I$21/100))*LCC!$I$22)","v":0},{"$f":"((LCC!$I$19*(LCC!$I$21/100))*(LCC!$I$22*(1+$E$21)))","v":0},{"$f":"((LCC!$I$19*(LCC!$I$21/100))*(LCC!$I$22*(1+$F$21)))","v":0},{"$f":"((LCC!$I$19*(LCC!$I$21/100))*(LCC!$I$22*(1+G$21)))","v":0},{"$f":"((LCC!$I$19*(LCC!$I$21/100))*(LCC!$I$22*(1+H$21)))","v":0},{"$f":"((LCC!$I$19*(LCC!$I$21/100))*(LCC!$I$22*(1+I$21)))","v":0},{"$f":"((LCC!$I$19*(LCC!$I$21/100))*(LCC!$I$22*(1+J$21)))","v":0},{"$f":"((LCC!$I$19*(LCC!$I$21/100))*(LCC!$I$22*(1+K$21)))","v":0},{"$f":"((LCC!$I$19*(LCC!$I$21/100))*(LCC!$I$22*(1+L$21)))","v":0},{"$f":"((LCC!$I$19*(LCC!$I$21/100))*(LCC!$I$22*(1+M$21)))","v":0},{"$f":"((LCC!$I$19*(LCC!$I$21/100))*(LCC!$I$22*(1+N$21)))","v":0},{"$f":"SUM(Y66:INDEX(Y66:AI66,LCC!$E$6))","v":0},null,"prodotto 6",{"$f":"((LCC!$I$19*(LCC!$I$25/100))*LCC!$I$26)","v":0},{"$f":"((LCC!$I$19*(LCC!$I$25/100))*(LCC!$I$26*(1+$E$21)))","v":0},{"$f":"((LCC!$I$19*(LCC!$I$25/100))*(LCC!$I$26*(1+$F$21)))","v":0},{"$f":"((LCC!$I$19*(LCC!$I$25/100))*(LCC!$I$26*(1+$G$21)))","v":0},{"$f":"((LCC!$I$19*(LCC!$I$25/100))*(LCC!$I$26*(1+$H$21)))","v":0},{"$f":"((LCC!$I$19*(LCC!$I$25/100))*(LCC!$I$26*(1+$I$21)))","v":0},{"$f":"((LCC!$I$19*(LCC!$I$25/100))*(LCC!$I$26*(1+$J$21)))","v":0},{"$f":"((LCC!$I$19*(LCC!$I$25/100))*(LCC!$I$26*(1+$K$21)))","v":0},{"$f":"((LCC!$I$19*(LCC!$I$25/100))*(LCC!$I$26*(1+$L$21)))","v":0},{"$f":"((LCC!$I$19*(LCC!$I$25/100))*(LCC!$I$26*(1+$M$21)))","v":0},{"$f":"((LCC!$I$19*(LCC!$I$25/100))*(LCC!$I$26*(1+$N$21)))","v":0},{"$f":"SUM(AM66:INDEX(AM66:AW66,LCC!$E$6))","v":0}]
[null,null,null,null,null,null,null,null,null,null,null,null,null,null,null,null,null,null,null,null,null,null,null,"prodotto 4",{"$f":"((LCC!$K$19*(LCC!$K$21/100))*LCC!$K$22)","v":0},{"$f":"((LCC!$K$19*(LCC!$K$21/100))*(LCC!$K$22*(1+$E$21)))","v":0},{"$f":"((LCC!$K$19*(LCC!$K$21/100))*(LCC!$K$22*(1+$F$21)))","v":0},{"$f":"((LCC!$K$19*(LCC!$K$21/100))*(LCC!$K$22*(1+G$21)))","v":0},{"$f":"((LCC!$K$19*(LCC!$K$21/100))*(LCC!$K$22*(1+H$21)))","v":0},{"$f":"((LCC!$K$19*(LCC!$K$21/100))*(LCC!$K$22*(1+I$21)))","v":0},{"$f":"((LCC!$K$19*(LCC!$K$21/100))*(LCC!$K$22*(1+J$21)))","v":0},{"$f":"((LCC!$K$19*(LCC!$K$21/100))*(LCC!$K$22*(1+K$21)))","v":0},{"$f":"((LCC!$K$19*(LCC!$K$21/100))*(LCC!$K$22*(1+L$21)))","v":0},{"$f":"((LCC!$K$19*(LCC!$K$21/100))*(LCC!$K$22*(1+M$21)))","v":0},{"$f":"((LCC!$K$19*(LCC!$K$21/100))*(LCC!$K$22*(1+N$21)))","v":0},{"$f":"SUM(Y67:INDEX(Y67:AI67,LCC!$E$6))","v":0},null,"prodotto 7",{"$f":"((LCC!$K$19*(LCC!$K$25/100))*LCC!$K$26)","v":0},{"$f":"((LCC!$K$19*(LCC!$K$25/100))*(LCC!$K$26*(1+$E$21)))","v":0},{"$f":"((LCC!$K$19*(LCC!$K$25/100))*(LCC!$K$26*(1+$F$21)))","v":0},{"$f":"((LCC!$K$19*(LCC!$K$25/100))*(LCC!$K$26*(1+$G$21)))","v":0},{"$f":"((LCC!$K$19*(LCC!$K$25/100))*(LCC!$K$26*(1+$H$21)))","v":0},{"$f":"((LCC!$K$19*(LCC!$K$25/100))*(LCC!$K$26*(1+$I$21)))","v":0},{"$f":"((LCC!$K$19*(LCC!$K$25/100))*(LCC!$K$26*(1+$J$21)))","v":0},{"$f":"((LCC!$K$19*(LCC!$K$25/100))*(LCC!$K$26*(1+$K$21)))","v":0},{"$f":"((LCC!$K$19*(LCC!$K$25/100))*(LCC!$K$26*(1+$L$21)))","v":0},{"$f":"((LCC!$K$19*(LCC!$K$25/100))*(LCC!$K$26*(1+$M$21)))","v":0},{"$f":"((LCC!$K$19*(LCC!$K$25/100))*(LCC!$K$26*(1+$N$21)))","v":0},{"$f":"SUM(AM67:INDEX(AM67:AW67,LCC!$E$6))","v":0}]
[null,null,null,null,null,null,null,null,null,null,null,null,null,null,null,null,null,null,null,null,null,null,null,"prodotto 5",{"$f":"((LCC!$M$19*(LCC!$M$21/100))*LCC!$M$22)","v":0},{"$f":"((LCC!$M$19*(LCC!$M$21/100))*(LCC!$M$22*(1+$E$21)))","v":0},{"$f":"((LCC!$M$19*(LCC!$M$21/100))*(LCC!$M$22*(1+$F$21)))","v":0},{"$f":"((LCC!$M$19*(LCC!$M$21/100))*(LCC!$M$22*(1+G$21)))","v":0},{"$f":"((LCC!$M$19*(LCC!$M$21/100))*(LCC!$M$22*(1+H$21)))","v":0},{"$f":"((LCC!$M$19*(LCC!$M$21/100))*(LCC!$M$22*(1+I$21)))","v":0},{"$f":"((LCC!$M$19*(LCC!$M$21/100))*(LCC!$M$22*(1+J$21)))","v":0},{"$f":"((LCC!$M$19*(LCC!$M$21/100))*(LCC!$M$22*(1+K$21)))","v":0},{"$f":"((LCC!$M$19*(LCC!$M$21/100))*(LCC!$M$22*(1+L$21)))","v":0},{"$f":"((LCC!$M$19*(LCC!$M$21/100))*(LCC!$M$22*(1+M$21)))","v":0},{"$f":"((LCC!$M$19*(LCC!$M$21/100))*(LCC!$M$22*(1+N$21)))","v":0},{"$f":"SUM(Y68:INDEX(Y68:AI68,LCC!$E$6))","v":0},null,"prodotto 8",{"$f":"((LCC!$M$19*(LCC!$M$25/100))*LCC!$M$26)","v":0},{"$f":"((LCC!$M$19*(LCC!$M$25/100))*(LCC!$M$26*(1+$E$21)))","v":0},{"$f":"((LCC!$M$19*(LCC!$M$25/100))*(LCC!$M$26*(1+$F$21)))","v":0},{"$f":"((LCC!$M$19*(LCC!$M$25/100))*(LCC!$M$26*(1+$G$21)))","v":0},{"$f":"((LCC!$M$19*(LCC!$M$25/100))*(LCC!$M$26*(1+$H$21)))","v":0},{"$f":"((LCC!$M$19*(LCC!$M$25/100))*(LCC!$M$26*(1+$I$21)))","v":0},{"$f":"((LCC!$M$19*(LCC!$M$25/100))*(LCC!$M$26*(1+$J$21)))","v":0},{"$f":"((LCC!$M$19*(LCC!$M$25/100))*(LCC!$M$26*(1+$K$21)))","v":0},{"$f":"((LCC!$M$19*(LCC!$M$25/100))*(LCC!$M$26*(1+$L$21)))","v":0},{"$f":"((LCC!$M$19*(LCC!$M$25/100))*(LCC!$M$26*(1+$M$21)))","v":0},{"$f":"((LCC!$M$19*(LCC!$M$25/100))*(LCC!$M$26*(1+$N$21)))","v":0},{"$f":"SUM(AM68:INDEX(AM68:AW68,LCC!$E$6))","v":0}]
[null,null,null,null,null,null,null,null,null,null,null,null,null,null,null,null,null,null,null,null,null,null,null,"prodotto 6",{"$f":"((LCC!$O$19*(LCC!$O$21/100))*LCC!$O$22)","v":0},{"$f":"((LCC!$O$19*(LCC!$O$21/100))*(LCC!$O$22*(1+$E$21)))","v":0},{"$f":"((LCC!$O$19*(LCC!$O$21/100))*(LCC!$O$22*(1+$F$21)))","v":0},{"$f":"((LCC!$O$19*(LCC!$O$21/100))*(LCC!$O$22*(1+G$21)))","v":0},{"$f":"((LCC!$O$19*(LCC!$O$21/100))*(LCC!$O$22*(1+H$21)))","v":0},{"$f":"((LCC!$O$19*(LCC!$O$21/100))*(LCC!$O$22*(1+I$21)))","v":0},{"$f":"((LCC!$O$19*(LCC!$O$21/100))*(LCC!$O$22*(1+J$21)))","v":0},{"$f":"((LCC!$O$19*(LCC!$O$21/100))*(LCC!$O$22*(1+K$21)))","v":0},{"$f":"((LCC!$O$19*(LCC!$O$21/100))*(LCC!$O$22*(1+L$21)))","v":0},{"$f":"((LCC!$O$19*(LCC!$O$21/100))*(LCC!$O$22*(1+M$21)))","v":0},{"$f":"((LCC!$O$19*(LCC!$O$21/100))*(LCC!$O$22*(1+N$21)))","v":0},{"$f":"SUM(Y69:INDEX(Y69:AI69,LCC!$E$6))","v":0},null,"prodotto 9",{"$f":"((LCC!$O$19*(LCC!$O$25/100))*LCC!$O$26)","v":0},{"$f":"((LCC!$O$19*(LCC!$O$25/100))*(LCC!$O$26*(1+$E$21)))","v":0},{"$f":"((LCC!$O$19*(LCC!$O$25/100))*(LCC!$O$26*(1+$F$21)))","v":0},{"$f":"((LCC!$O$19*(LCC!$O$25/100))*(LCC!$O$26*(1+$G$21)))","v":0},{"$f":"((LCC!$O$19*(LCC!$O$25/100))*(LCC!$O$26*(1+$H$21)))","v":0},{"$f":"((LCC!$O$19*(LCC!$O$25/100))*(LCC!$O$26*(1+$I$21)))","v":0},{"$f":"((LCC!$O$19*(LCC!$O$25/100))*(LCC!$O$26*(1+$J$21)))","v":0},{"$f":"((LCC!$O$19*(LCC!$O$25/100))*(LCC!$O$26*(1+$K$21)))","v":0},{"$f":"((LCC!$O$19*(LCC!$O$25/100))*(LCC!$O$26*(1+$L$21)))","v":0},{"$f":"((LCC!$O$19*(LCC!$O$25/100))*(LCC!$O$26*(1+$M$21)))","v":0},{"$f":"((LCC!$O$19*(LCC!$O$25/100))*(LCC!$O$26*(1+$N$21)))","v":0},{"$f":"SUM(AM69:INDEX(AM69:AW69,LCC!$E$6))","v":0}]
[null,null,null,null,null,null,null,null,null,null,null,null,null,null,null,null,null,null,null,null,null,null,null,"prodotto 7",{"$f":"((LCC!$Q$19*(LCC!$Q$21/100))*LCC!$Q$22)","v":0},{"$f":"((LCC!$Q$19*(LCC!$Q$21/100))*(LCC!$Q$22*(1+$E$21)))","v":0},{"$f":"((LCC!$Q$19*(LCC!$Q$21/100))*(LCC!$Q$22*(1+$F$21)))","v":0},{"$f":"((LCC!$Q$19*(LCC!$Q$21/100))*(LCC!$Q$22*(1+G$21)))","v":0},{"$f":"((LCC!$Q$19*(LCC!$Q$21/100))*(LCC!$Q$22*(1+H$21)))","v":0},{"$f":"((LCC!$Q$19*(LCC!$Q$21/100))*(LCC!$Q$22*(1+I$21)))","v":0},{"$f":"((LCC!$Q$19*(LCC!$Q$21/100))*(LCC!$Q$22*(1+J$21)))","v":0},{"$f":"((LCC!$Q$19*(LCC!$Q$21/100))*(LCC!$Q$22*(1+K$21)))","v":0},{"$f":"((LCC!$Q$19*(LCC!$Q$21/100))*(LCC!$Q$22*(1+L$21)))","v":0},{"$f":"((LCC!$Q$19*(LCC!$Q$21/100))*(LCC!$Q$22*(1+M$21)))","v":0},{"$f":"((LCC!$Q$19*(LCC!$Q$21/100))*(LCC!$Q$22*(1+N$21)))","v":0},{"$f":"SUM(Y70:INDEX(Y70:AI70,LCC!$E$6))","v":0},null,"prodotto 10",{"$f":"((LCC!$Q$19*(LCC!$Q$25/100))*LCC!$Q$26)","v":0},{"$f":"((LCC!$Q$19*(LCC!$Q$25/100))*(LCC!$Q$26*(1+$E$21)))","v":0},{"$f":"((LCC!$Q$19*(LCC!$Q$25/100))*(LCC!$Q$26*(1+$F$21)))","v":0},{"$f":"((LCC!$Q$19*(LCC!$Q$25/100))*(LCC!$Q$26*(1+$G$21)))","v":0},{"$f":"((LCC!$Q$19*(LCC!$Q$25/100))*(LCC!$Q$26*(1+$H$21)))","v":0},{"$f":"((LCC!$Q$19*(LCC!$Q$25/100))*(LCC!$Q$26*(1+$I$21)))","v":0},{"$f":"((LCC!$Q$19*(LCC!$Q$25/100))*(LCC!$Q$26*(1+$J$21)))","v":0},{"$f":"((LCC!$Q$19*(LCC!$Q$25/100))*(LCC!$Q$26*(1+$K$21)))","v":0},{"$f":"((LCC!$Q$19*(LCC!$Q$25/100))*(LCC!$Q$26*(1+$L$21)))","v":0},{"$f":"((LCC!$Q$19*(LCC!$Q$25/100))*(LCC!$Q$26*(1+$M$21)))","v":0},{"$f":"((LCC!$Q$19*(LCC!$Q$25/100))*(LCC!$Q$26*(1+$N$21)))","v":0},{"$f":"SUM(AM70:INDEX(AM70:AW70,LCC!$E$6))","v":0}]
[null,null,null,null,null,null,null,null,null,null,null,null,null,null,null,null,null,null,null,null,null,null,null,"prodotto 8",{"$f":"((LCC!$S$19*(LCC!$S$21/100))*LCC!$S$22)","v":0},{"$f":"((LCC!$S$19*(LCC!$S$21/100))*(LCC!$S$22*(1+$E$21)))","v":0},{"$f":"((LCC!$S$19*(LCC!$S$21/100))*(LCC!$S$22*(1+$F$21)))","v":0},{"$f":"((LCC!$S$19*(LCC!$S$21/100))*(LCC!$S$22*(1+G$21)))","v":0},{"$f":"((LCC!$S$19*(LCC!$S$21/100))*(LCC!$S$22*(1+H$21)))","v":0},{"$f":"((LCC!$S$19*(LCC!$S$21/100))*(LCC!$S$22*(1+I$21)))","v":0},{"$f":"((LCC!$S$19*(LCC!$S$21/100))*(LCC!$S$22*(1+J$21)))","v":0},{"$f":"((LCC!$S$19*(LCC!$S$21/100))*(LCC!$S$22*(1+K$21)))","v":0},{"$f":"((LCC!$S$19*(LCC!$S$21/100))*(LCC!$S$22*(1+L$21)))","v":0},{"$f":"((LCC!$S$19*(LCC!$S$21/100))*(LCC!$S$22*(1+M$21)))","v":0},{"$f":"((LCC!$S$19*(LCC!$S$21/100))*(LCC!$S$22*(1+N$21)))","v":0},{"$f":"SUM(Y71:INDEX(Y71:AI71,LCC!$E$6))","v":0},null,null,{"$f":"((LCC!$S$19*(LCC!$S$25/100))*LCC!$S$26)","v":0},{"$f":"((LCC!$S$19*(LCC!$S$25/100))*(LCC!$S$26*(1+$E$21)))","v":0},{"$f":"((LCC!$S$19*(LCC!$S$25/100))*(LCC!$S$26*(1+$F$21)))","v":0},{"$f":"((LCC!$S$19*(LCC!$S$25/100))*(LCC!$S$26*(1+$G$21)))","v":0},{"$f":"((LCC!$S$19*(LCC!$S$25/100))*(LCC!$S$26*(1+$H$21)))","v":0},{"$f":"((LCC!$S$19*(LCC!$S$25/100))*(LCC!$S$26*(1+$I$21)))","v":0},{"$f":"((LCC!$S$19*(LCC!$S$25/100))*(LCC!$S$26*(1+$J$21)))","v":0},{"$f":"((LCC!$S$19*(LCC!$S$25/100))*(LCC!$S$26*(1+$K$21)))","v":0},{"$f":"((LCC!$S$19*(LCC!$S$25/100))*(LCC!$S$26*(1+$L$21)))","v":0},{"$f":"((LCC!$S$19*(LCC!$S$25/100))*(LCC!$S$26*(1+$M$21)))","v":0},{"$f":"((LCC!$S$19*(LCC!$S$25/100))*(LCC!$S$26*(1+$N$21)))","v":0}]
[null,null,null,null,null,null,null,null,null,null,null,null,null,null,null,null,null,null,null,null,null,null,null,"prodotto 9",{"$f":"((LCC!$U$19*(LCC!$U$21/100))*LCC!$U$22)","v":0},{"$f":"((LCC!$U$19*(LCC!$U$21/100))*(LCC!$U$22*(1+$E$21)))","v":0},{"$f":"((LCC!$U$19*(LCC!$U$21/100))*(LCC!$U$22*(1+$F$21)))","v":0},{"$f":"((LCC!$U$19*(LCC!$U$21/100))*(LCC!$U$22*(1+G$21)))","v":0},{"$f":"((LCC!$U$19*(LCC!$U$21/100))*(LCC!$U$22*(1+H$21)))","v":0},{"$f":"((LCC!$U$19*(LCC!$U$21/100))*(LCC!$U$22*(1+I$21)))","v":0},{"$f":"((LCC!$U$19*(LCC!$U$21/100))*(LCC!$U$22*(1+J$21)))","v":0},{"$f":"((LCC!$U$19*(LCC!$U$21/100))*(LCC!$U$22*(1+K$21)))","v":0},{"$f":"((LCC!$U$19*(LCC!$U$21/100))*(LCC!$U$22*(1+L$21)))","v":0},{"$f":"((LCC!$U$19*(LCC!$U$21/100))*(LCC!$U$22*(1+M$21)))","v":0},{"$f":"((LCC!$U$19*(LCC!$U$21/100))*(LCC!$U$22*(1+N$21)))","v":0},{"$f":"SUM(Y72:INDEX(Y72:AI72,LCC!$E$6))","v":0},null,"NATURAL GAS",{"$f":"((LCC!$U$19*(LCC!$U$25/100))*LCC!$U$26)","v":0},{"$f":"((LCC!$U$19*(LCC!$U$25/100))*(LCC!$U$26*(1+$E$21)))","v":0},{"$f":"((LCC!$U$19*(LCC!$U$25/100))*(LCC!$U$26*(1+$F$21)))","v":0},{"$f":"((LCC!$U$19*(LCC!$U$25/100))*(LCC!$U$26*(1+$G$21)))","v":0},{"$f":"((LCC!$U$19*(LCC!$U$25/100))*(LCC!$U$26*(1+$H$21)))","v":0},{"$f":"((LCC!$U$19*(LCC!$U$25/100))*(LCC!$U$26*(1+$I$21)))","v":0},{"$f":"((LCC!$U$19*(LCC!$U$25/100))*(LCC!$U$26*(1+$J$21)))","v":0},{"$f":"((LCC!$U$19*(LCC!$U$25/100))*(LCC!$U$26*(1+$K$21)))","v":0},{"$f":"((LCC!$U$19*(LCC!$U$25/100))*(LCC!$U$26*(1+$L$21)))","v":0},{"$f":"((LCC!$U$19*(LCC!$U$25/100))*(LCC!$U$26*(1+$M$21)))","v":0},{"$f":"((LCC!$U$19*(LCC!$U$25/100))*(LCC!$U$26*(1+$N$21)))","v":0},"prezzo totale carburante per il periodo"]
[null,null,null,null,null,null,null,null,null,null,null,null,null,null,null,null,null,null,null,null,null,null,null,"prodotto 10",{"$f":"((LCC!$W$19*(LCC!$W$21/100))*LCC!$W$22)","v":0},{"$f":"((LCC!$W$19*(LCC!$W$21/100))*(LCC!$W$22*(1+$E$21)))","v":0},{"$f":"((LCC!$W$19*(LCC!$W$21/100))*(LCC!$W$22*(1+$F$21)))","v":0},{"$f":"((LCC!$W$19*(LCC!$W$21/100))*(LCC!$W$22*(1+G$21)))","v":0},{"$f":"((LCC!$W$19*(LCC!$W$21/100))*(LCC!$W$22*(1+H$21)))","v":0},{"$f":"((LCC!$W$19*(LCC!$W$21/100))*(LCC!$W$22*(1+I$21)))","v":0},{"$f":"((LCC!$W$19*(LCC!$W$21/100))*(LCC!$W$22*(1+J$21)))","v":0},{"$f":"((LCC!$W$19*(LCC!$W$21/100))*(LCC!$W$22*(1+K$21)))","v":0},{"$f":"((LCC!$W$19*(LCC!$W$21/100))*(LCC!$W$22*(1+L$21)))","v":0},{"$f":"((LCC!$W$19*(LCC!$W$21/100))*(LCC!$W$22*(1+M$21)))","v":0},{"$f":"((LCC!$W$19*(LCC!$W$21/100))*(LCC!$W$22*(1+N$21)))","v":0},{"$f":"SUM(Y73:INDEX(Y73:AI73,LCC!$E$6))","v":0},null,"prodotto 1",{"$f":"((LCC!$W$19*(LCC!$W$25/100))*LCC!$W$26)","v":0},{"$f":"((LCC!$W$19*(LCC!$W$25/100))*(LCC!$W$26*(1+$E$21)))","v":0},{"$f":"((LCC!$W$19*(LCC!$W$25/100))*(LCC!$W$26*(1+$F$21)))","v":0},{"$f":"((LCC!$W$19*(LCC!$W$25/100))*(LCC!$W$26*(1+$G$21)))","v":0},{"$f":"((LCC!$W$19*(LCC!$W$25/100))*(LCC!$W$26*(1+$H$21)))","v":0},{"$f":"((LCC!$W$19*(LCC!$W$25/100))*(LCC!$W$26*(1+$I$21)))","v":0},{"$f":"((LCC!$W$19*(LCC!$W$25/100))*(LCC!$W$26*(1+$J$21)))","v":0},{"$f":"((LCC!$W$19*(LCC!$W$25/100))*(LCC!$W$26*(1+$K$21)))","v":0},{"$f":"((LCC!$W$19*(LCC!$W$25/100))*(LCC!$W$26*(1+$L$21)))","v":0},{"$f":"((LCC!$W$19*(LCC!$W$25/100))*(LCC!$W$26*(1+$M$21)))","v":0},{"$f":"((LCC!$W$19*(LCC!$W$25/100))*(LCC!$W$26*(1+$N$21)))","v":0},{"$f":"SUM(AM73:INDEX(AM73:AW73,LCC!$E$6))","v":0}]
[null,null,null,null,null,null,null,null,null,null,null,null,null,null,null,null,null,null,null,null,null,null,null,null,null,null,null,null,null,null,null,null,null,null,null,null,null,"prodotto 2",null,null,null,null,null,null,null,null,null,null,null,{"$f":"SUM(AM74:INDEX(AM74:AW74,LCC!$E$6))","v":0}]
[null,null,null,null,null,null,null,null,null,null,null,null,null,null,null,null,null,null,null,null,null,null,null,"NATURAL GAS",2014,2015,2016,2017,2018,2019,2020,2021,2022,2023,2024,"Total fuel price for period",null,"prodotto 3",2014,2015,2016,2017,2018,2019,2020,2021,2022,2023,2024,{"$f":"SUM(AM75:INDEX(AM75:AW75,LCC!$E$6))","v":22209}]
[null,null,null,null,null,null,null,null,null,null,null,null,null,null,null,null,null,null,null,null,null,null,null,"prodotto 1",{"$f":"((LCC!$E$19*(LCC!$E$21/100))*LCC!$E$22)","v":0},{"$f":"((LCC!$E$19*(LCC!$E$21/100))*(LCC!$E$22*(1+$E$24)))","v":0},{"$f":"((LCC!$E$19*(LCC!$E$21/100))*(LCC!$E$22*(1+$F$24)))","v":0},{"$f":"((LCC!$E$19*(LCC!$E$21/100))*(LCC!$E$22*(1+G$24)))","v":0},{"$f":"((LCC!$E$19*(LCC!$E$21/100))*(LCC!$E$22*(1+H$24)))","v":0},{"$f":"((LCC!$E$19*(LCC!$E$21/100))*(LCC!$E$22*(1+I$24)))","v":0},{"$f":"((LCC!$E$19*(LCC!$E$21/100))*(LCC!$E$22*(1+J$24)))","v":0},{"$f":"((LCC!$E$19*(LCC!$E$21/100))*(LCC!$E$22*(1+K$24)))","v":0},{"$f":"((LCC!$E$19*(LCC!$E$21/100))*(LCC!$E$22*(1+L$24)))","v":0},{"$f":"((LCC!$E$19*(LCC!$E$21/100))*(LCC!$E$22*(1+M$24)))","v":0},{"$f":"((LCC!$E$19*(LCC!$E$21/100))*(LCC!$E$22*(1+N$24)))","v":0},{"$f":"SUM(Y76:INDEX(Y76:AI76,LCC!$E$6))","v":0},null,"prodotto 4",{"$f":"((LCC!$E$19*(LCC!$E$25/100))*LCC!$E$26)","v":0},{"$f":"((LCC!$E$19*(LCC!$E$25/100))*(LCC!$E$26*(1+$E$24)))","v":0},{"$f":"((LCC!$E$19*(LCC!$E$25/100))*(LCC!$E$26*(1+$F$24)))","v":0},{"$f":"((LCC!$E$19*(LCC!$E$25/100))*(LCC!$E$26*(1+$G$24)))","v":0},{"$f":"((LCC!$E$19*(LCC!$E$25/100))*(LCC!$E$26*(1+$H$24)))","v":0},{"$f":"((LCC!$E$19*(LCC!$E$25/100))*(LCC!$E$26*(1+$I$24)))","v":0},{"$f":"((LCC!$E$19*(LCC!$E$25/100))*(LCC!$E$26*(1+$J$24)))","v":0},{"$f":"((LCC!$E$19*(LCC!$E$25/100))*(LCC!$E$26*(1+$K$24)))","v":0},{"$f":"((LCC!$E$19*(LCC!$E$25/100))*(LCC!$E$26*(1+$L$24)))","v":0},{"$f":"((LCC!$E$19*(LCC!$E$25/100))*(LCC!$E$26*(1+$M$24)))","v":0},{"$f":"((LCC!$E$19*(LCC!$E$25/100))*(LCC!$E$26*(1+$N$24)))","v":0},{"$f":"SUM(AM76:INDEX(AM76:AW76,LCC!$E$6))","v":0}]
[null,null,null,null,null,null,null,null,null,null,null,null,null,null,null,null,null,null,null,null,null,null,null,"prodotto 2",{"$f":"((LCC!$G$19*(LCC!$G$21/100))*LCC!$G$22)","v":0},{"$f":"((LCC!$G$19*(LCC!$G$21/100))*(LCC!$G$22*(1+$E$24)))","v":0},{"$f":"((LCC!$G$19*(LCC!$G$21/100))*(LCC!$G$22*(1+$F$24)))","v":0},{"$f":"((LCC!$G$19*(LCC!$G$21/100))*(LCC!$G$22*(1+G$24)))","v":0},{"$f":"((LCC!$G$19*(LCC!$G$21/100))*(LCC!$G$22*(1+H$24)))","v":0},{"$f":"((LCC!$G$19*(LCC!$G$21/100))*(LCC!$G$22*(1+I$24)))","v":0},{"$f":"((LCC!$G$19*(LCC!$G$21/100))*(LCC!$G$22*(1+J$24)))","v":0},{"$f":"((LCC!$G$19*(LCC!$G$21/100))*(LCC!$G$22*(1+K$24)))","v":0},{"$f":"((LCC!$G$19*(LCC!$G$21/100))*(LCC!$G$22*(1+L$24)))","v":0},{"$f":"((LCC!$G$19*(LCC!$G$21/100))*(LCC!$G$22*(1+M$24)))","v":0},{"$f":"((LCC!$G$19*(LCC!$G$21/100))*(LCC!$G$22*(1+N$24)))","v":0},{"$f":"SUM(Y77:INDEX(Y77:AI77,LCC!$E$6))","v":0},null,"prodotto 5",{"$f":"((LCC!$G$19*(LCC!$G$25/100))*LCC!$G$26)","v":0},{"$f":"((LCC!$G$19*(LCC!$G$25/100))*(LCC!$G$26*(1+$E$24)))","v":0},{"$f":"((LCC!$G$19*(LCC!$G$25/100))*(LCC!$G$26*(1+$F$24)))","v":0},{"$f":"((LCC!$G$19*(LCC!$G$25/100))*(LCC!$G$26*(1+$G$24)))","v":0},{"$f":"((LCC!$G$19*(LCC!$G$25/100))*(LCC!$G$26*(1+$H$24)))","v":0},{"$f":"((LCC!$G$19*(LCC!$G$25/100))*(LCC!$G$26*(1+$I$24)))","v":0},{"$f":"((LCC!$G$19*(LCC!$G$25/100))*(LCC!$G$26*(1+$J$24)))","v":0},{"$f":"((LCC!$G$19*(LCC!$G$25/100))*(LCC!$G$26*(1+$K$24)))","v":0},{"$f":"((LCC!$G$19*(LCC!$G$25/100))*(LCC!$G$26*(1+$L$24)))","v":0},{"$f":"((LCC!$G$19*(LCC!$G$25/100))*(LCC!$G$26*(1+$M$24)))","v":0},{"$f":"((LCC!$G$19*(LCC!$G$25/100))*(LCC!$G$26*(1+$N$24)))","v":0},{"$f":"SUM(AM77:INDEX(AM77:AW77,LCC!$E$6))","v":0}]
[null,null,null,null,null,null,null,null,null,null,null,null,null,null,null,null,null,null,null,null,null,null,null,"prodotto 3",{"$f":"((LCC!$I$19*(LCC!$I$21/100))*LCC!$I$22)","v":0},{"$f":"((LCC!$I$19*(LCC!$I$21/100))*(LCC!$I$22*(1+$E$24)))","v":0},{"$f":"((LCC!$I$19*(LCC!$I$21/100))*(LCC!$I$22*(1+$F$24)))","v":0},{"$f":"((LCC!$I$19*(LCC!$I$21/100))*(LCC!$I$22*(1+G$24)))","v":0},{"$f":"((LCC!$I$19*(LCC!$I$21/100))*(LCC!$I$22*(1+H$24)))","v":0},{"$f":"((LCC!$I$19*(LCC!$I$21/100))*(LCC!$I$22*(1+I$24)))","v":0},{"$f":"((LCC!$I$19*(LCC!$I$21/100))*(LCC!$I$22*(1+J$24)))","v":0},{"$f":"((LCC!$I$19*(LCC!$I$21/100))*(LCC!$I$22*(1+K$24)))","v":0},{"$f":"((LCC!$I$19*(LCC!$I$21/100))*(LCC!$I$22*(1+L$24)))","v":0},{"$f":"((LCC!$I$19*(LCC!$I$21/100))*(LCC!$I$22*(1+M$24)))","v":0},{"$f":"((LCC!$I$19*(LCC!$I$21/100))*(LCC!$I$22*(1+N$24)))","v":0},{"$f":"SUM(Y78:INDEX(Y78:AI78,LCC!$E$6))","v":0},null,"prodotto 6",{"$f":"((LCC!$I$19*(LCC!$I$25/100))*LCC!$I$26)","v":0},{"$f":"((LCC!$I$19*(LCC!$I$25/100))*(LCC!$I$26*(1+$E$24)))","v":0},{"$f":"((LCC!$I$19*(LCC!$I$25/100))*(LCC!$I$26*(1+$F$24)))","v":0},{"$f":"((LCC!$I$19*(LCC!$I$25/100))*(LCC!$I$26*(1+$G$24)))","v":0},{"$f":"((LCC!$I$19*(LCC!$I$25/100))*(LCC!$I$26*(1+$H$24)))","v":0},{"$f":"((LCC!$I$19*(LCC!$I$25/100))*(LCC!$I$26*(1+$I$24)))","v":0},{"$f":"((LCC!$I$19*(LCC!$I$25/100))*(LCC!$I$26*(1+$J$24)))","v":0},{"$f":"((LCC!$I$19*(LCC!$I$25/100))*(LCC!$I$26*(1+$K$24)))","v":0},{"$f":"((LCC!$I$19*(LCC!$I$25/100))*(LCC!$I$26*(1+$L$24)))","v":0},{"$f":"((LCC!$I$19*(LCC!$I$25/100))*(LCC!$I$26*(1+$M$24)))","v":0},{"$f":"((LCC!$I$19*(LCC!$I$25/100))*(LCC!$I$26*(1+$N$24)))","v":0},{"$f":"SUM(AM78:INDEX(AM78:AW78,LCC!$E$6))","v":0}]
[null,null,null,null,null,null,null,null,null,null,null,null,null,null,null,null,null,null,null,null,null,null,null,"prodotto 4",{"$f":"((LCC!$K$19*(LCC!$K$21/100))*LCC!$K$22)","v":0},{"$f":"((LCC!$K$19*(LCC!$K$21/100))*(LCC!$K$22*(1+$E$24)))","v":0},{"$f":"((LCC!$K$19*(LCC!$K$21/100))*(LCC!$K$22*(1+$F$24)))","v":0},{"$f":"((LCC!$K$19*(LCC!$K$21/100))*(LCC!$K$22*(1+G$24)))","v":0},{"$f":"((LCC!$K$19*(LCC!$K$21/100))*(LCC!$K$22*(1+H$24)))","v":0},{"$f":"((LCC!$K$19*(LCC!$K$21/100))*(LCC!$K$22*(1+I$24)))","v":0},{"$f":"((LCC!$K$19*(LCC!$K$21/100))*(LCC!$K$22*(1+J$24)))","v":0},{"$f":"((LCC!$K$19*(LCC!$K$21/100))*(LCC!$K$22*(1+K$24)))","v":0},{"$f":"((LCC!$K$19*(LCC!$K$21/100))*(LCC!$K$22*(1+L$24)))","v":0},{"$f":"((LCC!$K$19*(LCC!$K$21/100))*(LCC!$K$22*(1+M$24)))","v":0},{"$f":"((LCC!$K$19*(LCC!$K$21/100))*(LCC!$K$22*(1+N$24)))","v":0},{"$f":"SUM(Y79:INDEX(Y79:AI79,LCC!$E$6))","v":0},null,"prodotto 7",{"$f":"((LCC!$K$19*(LCC!$K$25/100))*LCC!$K$26)","v":0},{"$f":"((LCC!$K$19*(LCC!$K$25/100))*(LCC!$K$26*(1+$E$24)))","v":0},{"$f":"((LCC!$K$19*(LCC!$K$25/100))*(LCC!$K$26*(1+$F$24)))","v":0},{"$f":"((LCC!$K$19*(LCC!$K$25/100))*(LCC!$K$26*(1+$G$24)))","v":0},{"$f":"((LCC!$K$19*(LCC!$K$25/100))*(LCC!$K$26*(1+$H$24)))","v":0},{"$f":"((LCC!$K$19*(LCC!$K$25/100))*(LCC!$K$26*(1+$I$24)))","v":0},{"$f":"((LCC!$K$19*(LCC!$K$25/100))*(LCC!$K$26*(1+$J$24)))","v":0},{"$f":"((LCC!$K$19*(LCC!$K$25/100))*(LCC!$K$26*(1+$K$24)))","v":0},{"$f":"((LCC!$K$19*(LCC!$K$25/100))*(LCC!$K$26*(1+$L$24)))","v":0},{"$f":"((LCC!$K$19*(LCC!$K$25/100))*(LCC!$K$26*(1+$M$24)))","v":0},{"$f":"((LCC!$K$19*(LCC!$K$25/100))*(LCC!$K$26*(1+$N$24)))","v":0},{"$f":"SUM(AM79:INDEX(AM79:AW79,LCC!$E$6))","v":0}]
[null,null,null,null,null,null,null,null,null,null,null,null,null,null,null,null,null,null,null,null,null,null,null,"prodotto 5",{"$f":"((LCC!$M$19*(LCC!$M$21/100))*LCC!$M$22)","v":0},{"$f":"((LCC!$M$19*(LCC!$M$21/100))*(LCC!$M$22*(1+$E$24)))","v":0},{"$f":"((LCC!$M$19*(LCC!$M$21/100))*(LCC!$M$22*(1+$F$24)))","v":0},{"$f":"((LCC!$M$19*(LCC!$M$21/100))*(LCC!$M$22*(1+G$24)))","v":0},{"$f":"((LCC!$M$19*(LCC!$M$21/100))*(LCC!$M$22*(1+H$24)))","v":0},{"$f":"((LCC!$M$19*(LCC!$M$21/100))*(LCC!$M$22*(1+I$24)))","v":0},{"$f":"((LCC!$M$19*(LCC!$M$21/100))*(LCC!$M$22*(1+J$24)))","v":0},{"$f":"((LCC!$M$19*(LCC!$M$21/100))*(LCC!$M$22*(1+K$24)))","v":0},{"$f":"((LCC!$M$19*(LCC!$M$21/100))*(LCC!$M$22*(1+L$24)))","v":0},{"$f":"((LCC!$M$19*(LCC!$M$21/100))*(LCC!$M$22*(1+M$24)))","v":0},{"$f":"((LCC!$M$19*(LCC!$M$21/100))*(LCC!$M$22*(1+N$24)))","v":0},{"$f":"SUM(Y80:INDEX(Y80:AI80,LCC!$E$6))","v":0},null,"prodotto 8",{"$f":"((LCC!$M$19*(LCC!$M$25/100))*LCC!$M$26)","v":0},{"$f":"((LCC!$M$19*(LCC!$M$25/100))*(LCC!$M$26*(1+$E$24)))","v":0},{"$f":"((LCC!$M$19*(LCC!$M$25/100))*(LCC!$M$26*(1+$F$24)))","v":0},{"$f":"((LCC!$M$19*(LCC!$M$25/100))*(LCC!$M$26*(1+$G$24)))","v":0},{"$f":"((LCC!$M$19*(LCC!$M$25/100))*(LCC!$M$26*(1+$H$24)))","v":0},{"$f":"((LCC!$M$19*(LCC!$M$25/100))*(LCC!$M$26*(1+$I$24)))","v":0},{"$f":"((LCC!$M$19*(LCC!$M$25/100))*(LCC!$M$26*(1+$J$24)))","v":0},{"$f":"((LCC!$M$19*(LCC!$M$25/100))*(LCC!$M$26*(1+$K$24)))","v":0},{"$f":"((LCC!$M$19*(LCC!$M$25/100))*(LCC!$M$26*(1+$L$24)))","v":0},{"$f":"((LCC!$M$19*(LCC!$M$25/100))*(LCC!$M$26*(1+$M$24)))","v":0},{"$f":"((LCC!$M$19*(LCC!$M$25/100))*(LCC!$M$26*(1+$N$24)))","v":0},{"$f":"SUM(AM80:INDEX(AM80:AW80,LCC!$E$6))","v":0}]
[null,null,null,null,null,null,null,null,null,null,null,null,null,null,null,null,null,null,null,null,null,null,null,"prodotto 6",{"$f":"((LCC!$O$19*(LCC!$O$21/100))*LCC!$O$22)","v":0},{"$f":"((LCC!$O$19*(LCC!$O$21/100))*(LCC!$O$22*(1+$E$24)))","v":0},{"$f":"((LCC!$O$19*(LCC!$O$21/100))*(LCC!$O$22*(1+$F$24)))","v":0},{"$f":"((LCC!$O$19*(LCC!$O$21/100))*(LCC!$O$22*(1+G$24)))","v":0},{"$f":"((LCC!$O$19*(LCC!$O$21/100))*(LCC!$O$22*(1+H$24)))","v":0},{"$f":"((LCC!$O$19*(LCC!$O$21/100))*(LCC!$O$22*(1+I$24)))","v":0},{"$f":"((LCC!$O$19*(LCC!$O$21/100))*(LCC!$O$22*(1+J$24)))","v":0},{"$f":"((LCC!$O$19*(LCC!$O$21/100))*(LCC!$O$22*(1+K$24)))","v":0},{"$f":"((LCC!$O$19*(LCC!$O$21/100))*(LCC!$O$22*(1+L$24)))","v":0},{"$f":"((LCC!$O$19*(LCC!$O$21/100))*(LCC!$O$22*(1+M$24)))","v":0},{"$f":"((LCC!$O$19*(LCC!$O$21/100))*(LCC!$O$22*(1+N$24)))","v":0},{"$f":"SUM(Y81:INDEX(Y81:AI81,LCC!$E$6))","v":0},null,"prodotto 9",{"$f":"((LCC!$O$19*(LCC!$O$25/100))*LCC!$O$26)","v":0},{"$f":"((LCC!$O$19*(LCC!$O$25/100))*(LCC!$O$26*(1+$E$24)))","v":0},{"$f":"((LCC!$O$19*(LCC!$O$25/100))*(LCC!$O$26*(1+$F$24)))","v":0},{"$f":"((LCC!$O$19*(LCC!$O$25/100))*(LCC!$O$26*(1+$G$24)))","v":0},{"$f":"((LCC!$O$19*(LCC!$O$25/100))*(LCC!$O$26*(1+$H$24)))","v":0},{"$f":"((LCC!$O$19*(LCC!$O$25/100))*(LCC!$O$26*(1+$I$24)))","v":0},{"$f":"((LCC!$O$19*(LCC!$O$25/100))*(LCC!$O$26*(1+$J$24)))","v":0},{"$f":"((LCC!$O$19*(LCC!$O$25/100))*(LCC!$O$26*(1+$K$24)))","v":0},{"$f":"((LCC!$O$19*(LCC!$O$25/100))*(LCC!$O$26*(1+$L$24)))","v":0},{"$f":"((LCC!$O$19*(LCC!$O$25/100))*(LCC!$O$26*(1+$M$24)))","v":0},{"$f":"((LCC!$O$19*(LCC!$O$25/100))*(LCC!$O$26*(1+$N$24)))","v":0},{"$f":"SUM(AM81:INDEX(AM81:AW81,LCC!$E$6))","v":0}]
[null,null,null,null,null,null,null,null,null,null,null,null,null,null,null,null,null,null,null,null,null,null,null,"prodotto 7",{"$f":"((LCC!$Q$19*(LCC!$Q$21/100))*LCC!$Q$22)","v":0},{"$f":"((LCC!$Q$19*(LCC!$Q$21/100))*(LCC!$Q$22*(1+$E$24)))","v":0},{"$f":"((LCC!$Q$19*(LCC!$Q$21/100))*(LCC!$Q$22*(1+$F$24)))","v":0},{"$f":"((LCC!$Q$19*(LCC!$Q$21/100))*(LCC!$Q$22*(1+G$24)))","v":0},{"$f":"((LCC!$Q$19*(LCC!$Q$21/100))*(LCC!$Q$22*(1+H$24)))","v":0},{"$f":"((LCC!$Q$19*(LCC!$Q$21/100))*(LCC!$Q$22*(1+I$24)))","v":0},{"$f":"((LCC!$Q$19*(LCC!$Q$21/100))*(LCC!$Q$22*(1+J$24)))","v":0},{"$f":"((LCC!$Q$19*(LCC!$Q$21/100))*(LCC!$Q$22*(1+K$24)))","v":0},{"$f":"((LCC!$Q$19*(LCC!$Q$21/100))*(LCC!$Q$22*(1+L$24)))","v":0},{"$f":"((LCC!$Q$19*(LCC!$Q$21/100))*(LCC!$Q$22*(1+M$24)))","v":0},{"$f":"((LCC!$Q$19*(LCC!$Q$21/100))*(LCC!$Q$22*(1+N$24)))","v":0},{"$f":"SUM(Y82:INDEX(Y82:AI82,LCC!$E$6))","v":0},null,"prodotto 10",{"$f":"((LCC!$Q$19*(LCC!$Q$25/100))*LCC!$Q$26)","v":0},{"$f":"((LCC!$Q$19*(LCC!$Q$25/100))*(LCC!$Q$26*(1+$E$24)))","v":0},{"$f":"((LCC!$Q$19*(LCC!$Q$25/100))*(LCC!$Q$26*(1+$F$24)))","v":0},{"$f":"((LCC!$Q$19*(LCC!$Q$25/100))*(LCC!$Q$26*(1+$G$24)))","v":0},{"$f":"((LCC!$Q$19*(LCC!$Q$25/100))*(LCC!$Q$26*(1+$H$24)))","v":0},{"$f":"((LCC!$Q$19*(LCC!$Q$25/100))*(LCC!$Q$26*(1+$I$24)))","v":0},{"$f":"((LCC!$Q$19*(LCC!$Q$25/100))*(LCC!$Q$26*(1+$J$24)))","v":0},{"$f":"((LCC!$Q$19*(LCC!$Q$25/100))*(LCC!$Q$26*(1+$K$24)))","v":0},{"$f":"((LCC!$Q$19*(LCC!$Q$25/100))*(LCC!$Q$26*(1+$L$24)))","v":0},{"$f":"((LCC!$Q$19*(LCC!$Q$25/100))*(LCC!$Q$26*(1+$M$24)))","v":0},{"$f":"((LCC!$Q$19*(LCC!$Q$25/100))*(LCC!$Q$26*(1+$N$24)))","v":0},{"$f":"SUM(AM82:INDEX(AM82:AW82,LCC!$E$6))","v":0}]
[null,null,null,null,null,null,null,null,null,null,null,null,null,null,null,null,null,null,null,null,null,null,null,"prodotto 8",{"$f":"((LCC!$S$19*(LCC!$S$21/100))*LCC!$S$22)","v":0},{"$f":"((LCC!$S$19*(LCC!$S$21/100))*(LCC!$S$22*(1+$E$24)))","v":0},{"$f":"((LCC!$S$19*(LCC!$S$21/100))*(LCC!$S$22*(1+$F$24)))","v":0},{"$f":"((LCC!$S$19*(LCC!$S$21/100))*(LCC!$S$22*(1+G$24)))","v":0},{"$f":"((LCC!$S$19*(LCC!$S$21/100))*(LCC!$S$22*(1+H$24)))","v":0},{"$f":"((LCC!$S$19*(LCC!$S$21/100))*(LCC!$S$22*(1+I$24)))","v":0},{"$f":"((LCC!$S$19*(LCC!$S$21/100))*(LCC!$S$22*(1+J$24)))","v":0},{"$f":"((LCC!$S$19*(LCC!$S$21/100))*(LCC!$S$22*(1+K$24)))","v":0},{"$f":"((LCC!$S$19*(LCC!$S$21/100))*(LCC!$S$22*(1+L$24)))","v":0},{"$f":"((LCC!$S$19*(LCC!$S$21/100))*(LCC!$S$22*(1+M$24)))","v":0},{"$f":"((LCC!$S$19*(LCC!$S$21/100))*(LCC!$S$22*(1+N$24)))","v":0},{"$f":"SUM(Y83:INDEX(Y83:AI83,LCC!$E$6))","v":0},null,null,{"$f":"((LCC!$S$19*(LCC!$S$25/100))*LCC!$S$26)","v":0},{"$f":"((LCC!$S$19*(LCC!$S$25/100))*(LCC!$S$26*(1+$E$24)))","v":0},{"$f":"((LCC!$S$19*(LCC!$S$25/100))*(LCC!$S$26*(1+$F$24)))","v":0},{"$f":"((LCC!$S$19*(LCC!$S$25/100))*(LCC!$S$26*(1+$G$24)))","v":0},{"$f":"((LCC!$S$19*(LCC!$S$25/100))*(LCC!$S$26*(1+$H$24)))","v":0},{"$f":"((LCC!$S$19*(LCC!$S$25/100))*(LCC!$S$26*(1+$I$24)))","v":0},{"$f":"((LCC!$S$19*(LCC!$S$25/100))*(LCC!$S$26*(1+$J$24)))","v":0},{"$f":"((LCC!$S$19*(LCC!$S$25/100))*(LCC!$S$26*(1+$K$24)))","v":0},{"$f":"((LCC!$S$19*(LCC!$S$25/100))*(LCC!$S$26*(1+$L$24)))","v":0},{"$f":"((LCC!$S$19*(LCC!$S$25/100))*(LCC!$S$26*(1+$M$24)))","v":0},{"$f":"((LCC!$S$19*(LCC!$S$25/100))*(LCC!$S$26*(1+$N$24)))","v":0}]
[null,null,null,null,null,null,null,null,null,null,null,null,null,null,null,null,null,null,null,null,null,null,null,"prodotto 9",{"$f":"((LCC!$U$19*(LCC!$U$21/100))*LCC!$U$22)","v":0},{"$f":"((LCC!$U$19*(LCC!$U$21/100))*(LCC!$U$22*(1+$E$24)))","v":0},{"$f":"((LCC!$U$19*(LCC!$U$21/100))*(LCC!$U$22*(1+$F$24)))","v":0},{"$f":"((LCC!$U$19*(LCC!$U$21/100))*(LCC!$U$22*(1+G$24)))","v":0},{"$f":"((LCC!$U$19*(LCC!$U$21/100))*(LCC!$U$22*(1+H$24)))","v":0},{"$f":"((LCC!$U$19*(LCC!$U$21/100))*(LCC!$U$22*(1+I$24)))","v":0},{"$f":"((LCC!$U$19*(LCC!$U$21/100))*(LCC!$U$22*(1+J$24)))","v":0},{"$f":"((LCC!$U$19*(LCC!$U$21/100))*(LCC!$U$22*(1+K$24)))","v":0},{"$f":"((LCC!$U$19*(LCC!$U$21/100))*(LCC!$U$22*(1+L$24)))","v":0},{"$f":"((LCC!$U$19*(LCC!$U$21/100))*(LCC!$U$22*(1+M$24)))","v":0},{"$f":"((LCC!$U$19*(LCC!$U$21/100))*(LCC!$U$22*(1+N$24)))","v":0},{"$f":"SUM(Y84:INDEX(Y84:AI84,LCC!$E$6))","v":0},null,"BATTERY",{"$f":"((LCC!$U$19*(LCC!$U$25/100))*LCC!$U$26)","v":0},{"$f":"((LCC!$U$19*(LCC!$U$25/100))*(LCC!$U$26*(1+$E$24)))","v":0},{"$f":"((LCC!$U$19*(LCC!$U$25/100))*(LCC!$U$26*(1+$F$24)))","v":0},{"$f":"((LCC!$U$19*(LCC!$U$25/100))*(LCC!$U$26*(1+$G$24)))","v":0},{"$f":"((LCC!$U$19*(LCC!$U$25/100))*(LCC!$U$26*(1+$H$24)))","v":0},{"$f":"((LCC!$U$19*(LCC!$U$25/100))*(LCC!$U$26*(1+$I$24)))","v":0},{"$f":"((LCC!$U$19*(LCC!$U$25/100))*(LCC!$U$26*(1+$J$24)))","v":0},{"$f":"((LCC!$U$19*(LCC!$U$25/100))*(LCC!$U$26*(1+$K$24)))","v":0},{"$f":"((LCC!$U$19*(LCC!$U$25/100))*(LCC!$U$26*(1+$L$24)))","v":0},{"$f":"((LCC!$U$19*(LCC!$U$25/100))*(LCC!$U$26*(1+$M$24)))","v":0},{"$f":"((LCC!$U$19*(LCC!$U$25/100))*(LCC!$U$26*(1+$N$24)))","v":0},"Cost of replacements for period"]
[null,null,null,null,null,null,null,null,null,null,null,null,null,null,null,null,null,null,null,null,null,null,null,"prodotto 10",{"$f":"((LCC!$W$19*(LCC!$W$21/100))*LCC!$W$22)","v":0},{"$f":"((LCC!$W$19*(LCC!$W$21/100))*(LCC!$W$22*(1+$E$24)))","v":0},{"$f":"((LCC!$W$19*(LCC!$W$21/100))*(LCC!$W$22*(1+$F$24)))","v":0},{"$f":"((LCC!$W$19*(LCC!$W$21/100))*(LCC!$W$22*(1+G$24)))","v":0},{"$f":"((LCC!$W$19*(LCC!$W$21/100))*(LCC!$W$22*(1+H$24)))","v":0},{"$f":"((LCC!$W$19*(LCC!$W$21/100))*(LCC!$W$22*(1+I$24)))","v":0},{"$f":"((LCC!$W$19*(LCC!$W$21/100))*(LCC!$W$22*(1+J$24)))","v":0},{"$f":"((LCC!$W$19*(LCC!$W$21/100))*(LCC!$W$22*(1+K$24)))","v":0},{"$f":"((LCC!$W$19*(LCC!$W$21/100))*(LCC!$W$22*(1+L$24)))","v":0},{"$f":"((LCC!$W$19*(LCC!$W$21/100))*(LCC!$W$22*(1+M$24)))","v":0},{"$f":"((LCC!$W$19*(LCC!$W$21/100))*(LCC!$W$22*(1+N$24)))","v":0},{"$f":"SUM(Y85:INDEX(Y85:AI85,LCC!$E$6))","v":0},null,"prodotto 1",{"$f":"((LCC!$W$19*(LCC!$W$25/100))*LCC!$W$26)","v":0},{"$f":"((LCC!$W$19*(LCC!$W$25/100))*(LCC!$W$26*(1+$E$24)))","v":0},{"$f":"((LCC!$W$19*(LCC!$W$25/100))*(LCC!$W$26*(1+$F$24)))","v":0},{"$f":"((LCC!$W$19*(LCC!$W$25/100))*(LCC!$W$26*(1+$G$24)))","v":0},{"$f":"((LCC!$W$19*(LCC!$W$25/100))*(LCC!$W$26*(1+$H$24)))","v":0},{"$f":"((LCC!$W$19*(LCC!$W$25/100))*(LCC!$W$26*(1+$I$24)))","v":0},{"$f":"((LCC!$W$19*(LCC!$W$25/100))*(LCC!$W$26*(1+$J$24)))","v":0},{"$f":"((LCC!$W$19*(LCC!$W$25/100))*(LCC!$W$26*(1+$K$24)))","v":0},{"$f":"((LCC!$W$19*(LCC!$W$25/100))*(LCC!$W$26*(1+$L$24)))","v":0},{"$f":"((LCC!$W$19*(LCC!$W$25/100))*(LCC!$W$26*(1+$M$24)))","v":0},{"$f":"((LCC!$W$19*(LCC!$W$25/100))*(LCC!$W$26*(1+$N$24)))","v":0},{"$f":"SUM(AM85:INDEX(AM85:AW85,LCC!$E$6))","v":0}]
[null,null,null,null,null,null,null,null,null,null,null,null,null,null,null,null,null,null,null,null,null,null,null,null,null,null,null,null,null,null,null,null,null,null,null,null,null,"prodotto 2",0,{"$f":"IF(LCC!$G$28=1,LCC!$G$27,0)","v":0},{"$f":"IF(OR(LCC!$G$28=1,$E$24=2),LCC!$G$27,0)","v":0},{"$f":"IF(OR(LCC!$G$28=1,LCC!$G$28=3),LCC!$G$27,0)","v":0},{"$f":"IF(OR(LCC!$G$28=1,LCC!$G$28=2,LCC!$G$28=4),LCC!$G$27,0)","v":0},{"$f":"IF(OR(LCC!$G$28=1,LCC!$G$28=5),LCC!$G$27,0)","v":0},{"$f":"IF(OR(LCC!$G$28=1,LCC!$G$28=2,LCC!$G$28=3,LCC!$G$28=6),LCC!$G$27,0)","v":0},{"$f":"IF(OR(LCC!$G$28=1,LCC!$G$28=7),LCC!$G$27,0)","v":0},{"$f":"IF(OR(LCC!$G$28=1,LCC!$G$28=2,LCC!$G$28=4,LCC!$G$28=8),LCC!$G$27,0)","v":0},{"$f":"IF(OR(LCC!$G$28=1,LCC!$G$28=3,LCC!$G$28=9),LCC!$G$27,0)","v":0},{"$f":"IF(OR(LCC!$G$28=1,LCC!$G$28=2,LCC!$G$28=5,LCC!$G$28=10),LCC!$G$27,0)","v":0},{"$f":"SUM(AM86:INDEX(AM86:AW86,LCC!$E$6))","v":0}]
[null,null,null,null,null,null,null,null,null,null,null,null,null,null,null,null,null,null,null,null,null,null,null,"BATTERY",2014,2015,2016,2017,2018,2019,2020,2021,2022,2023,2024,"Cost of replacements for period",null,"prodotto 3",0,{"$f":"IF(LCC!$I$28=1,LCC!$I$27,0)","v":0},{"$f":"IF(OR(LCC!$I$28=1,$E$24=2),LCC!$I$27,0)","v":0},{"$f":"IF(OR(LCC!$I$28=1,LCC!$I$28=3),LCC!$I$27,0)","v":0},{"$f":"IF(OR(LCC!$I$28=1,LCC!$I$28=2,LCC!$I$28=4),LCC!$I$27,0)","v":0},{"$f":"IF(OR(LCC!$I$28=1,LCC!$I$28=5),LCC!$I$27,0)","v":0},{"$f":"IF(OR(LCC!$I$28=1,LCC!$I$28=2,LCC!$I$28=3,LCC!$I$28=6),LCC!$I$27,0)","v":0},{"$f":"IF(OR(LCC!$I$28=1,LCC!$I$28=7),LCC!$I$27,0)","v":0},{"$f":"IF(OR(LCC!$I$28=1,LCC!$I$28=2,LCC!$I$28=4,LCC!$I$28=8),LCC!$I$27,0)","v":0},{"$f":"IF(OR(LCC!$I$28=1,LCC!$I$28=3,LCC!$I$28=9),LCC!$I$27,0)","v":0},{"$f":"IF(OR(LCC!$I$28=1,LCC!$I$28=2,LCC!$I$28=5,LCC!$I$28=10),LCC!$I$27,0)","v":0},{"$f":"SUM(AM87:INDEX(AM87:AW87,LCC!$E$6))","v":0}]
[null,null,null,null,null,null,null,null,null,null,null,null,null,null,null,null,null,null,null,null,null,null,null,"prodotto 1",0,{"$f":"IF(LCC!$E$28=1,LCC!$E$27,0)","v":0},{"$f":"IF(OR(LCC!$E$28=1,$E$24=2),LCC!$E$27,0)","v":0},{"$f":"IF(OR(LCC!$E$28=1,LCC!$E$28=3),LCC!$E$27,0)","v":0},{"$f":"IF(OR(LCC!$E$28=1,LCC!$E$28=2,LCC!$E$28=4),LCC!$E$27,0)","v":0},{"$f":"IF(OR(LCC!$E$28=1,LCC!$E$28=5),LCC!$E$27,0)","v":0},{"$f":"IF(OR(LCC!$E$28=1,LCC!$E$28=2,LCC!$E$28=3,LCC!$E$28=6),LCC!$E$27,0)","v":0},{"$f":"IF(OR(LCC!$E$28=1,LCC!$E$28=7),LCC!$E$27,0)","v":0},{"$f":"IF(OR(LCC!$E$28=1,LCC!$E$28=2,LCC!$E$28=4,LCC!$E$28=8),LCC!$E$27,0)","v":0},{"$f":"IF(OR(LCC!$E$28=1,LCC!$E$28=3,LCC!$E$28=9),LCC!$E$27,0)","v":0},{"$f":"IF(OR(LCC!$E$28=1,LCC!$E$28=2,LCC!$E$28=5,LCC!$E$28=10),LCC!$E$27,0)","v":0},{"$f":"SUM(Y88:INDEX(Y88:AI88,LCC!$E$6))","v":0},null,"prodotto 4",0,{"$f":"IF(LCC!$K$28=1,LCC!$K$27,0)","v":0},{"$f":"IF(OR(LCC!$K$28=1,$E$24=2),LCC!$K$27,0)","v":0},{"$f":"IF(OR(LCC!$K$28=1,LCC!$K$28=3),LCC!$K$27,0)","v":0},{"$f":"IF(OR(LCC!$K$28=1,LCC!$K$28=2,LCC!$K$28=4),LCC!$K$27,0)","v":0},{"$f":"IF(OR(LCC!$K$28=1,LCC!$K$28=5),LCC!$K$27,0)","v":0},{"$f":"IF(OR(LCC!$K$28=1,LCC!$K$28=2,LCC!$K$28=3,LCC!$K$28=6),LCC!$K$27,0)","v":0},{"$f":"IF(OR(LCC!$K$28=1,LCC!$K$28=7),LCC!$K$27,0)","v":0},{"$f":"IF(OR(LCC!$K$28=1,LCC!$K$28=2,LCC!$K$28=4,LCC!$K$28=8),LCC!$K$27,0)","v":0},{"$f":"IF(OR(LCC!$K$28=1,LCC!$K$28=3,LCC!$K$28=9),LCC!$K$27,0)","v":0},{"$f":"IF(OR(LCC!$K$28=1,LCC!$K$28=2,LCC!$K$28=5,LCC!$K$28=10),LCC!$K$27,0)","v":0},{"$f":"SUM(AM88:INDEX(AM88:AW88,LCC!$E$6))","v":0}]
[null,null,null,null,null,null,null,null,null,null,null,null,null,null,null,null,null,null,null,null,null,null,null,"prodotto 2",0,{"$f":"IF(LCC!$G$28=1,LCC!$G$27,0)","v":0},{"$f":"IF(OR(LCC!$G$28=1,$E$24=2),LCC!$G$27,0)","v":0},{"$f":"IF(OR(LCC!$G$28=1,LCC!$G$28=3),LCC!$G$27,0)","v":0},{"$f":"IF(OR(LCC!$G$28=1,LCC!$G$28=2,LCC!$G$28=4),LCC!$G$27,0)","v":0},{"$f":"IF(OR(LCC!$G$28=1,LCC!$G$28=5),LCC!$G$27,0)","v":0},{"$f":"IF(OR(LCC!$G$28=1,LCC!$G$28=2,LCC!$G$28=3,LCC!$G$28=6),LCC!$G$27,0)","v":0},{"$f":"IF(OR(LCC!$G$28=1,LCC!$G$28=7),LCC!$G$27,0)","v":0},{"$f":"IF(OR(LCC!$G$28=1,LCC!$G$28=2,LCC!$G$28=4,LCC!$G$28=8),LCC!$G$27,0)","v":0},{"$f":"IF(OR(LCC!$G$28=1,LCC!$G$28=3,LCC!$G$28=9),LCC!$G$27,0)","v":0},{"$f":"IF(OR(LCC!$G$28=1,LCC!$G$28=2,LCC!$G$28=5,LCC!$G$28=10),LCC!$G$27,0)","v":0},{"$f":"SUM(Y89:INDEX(Y89:AI89,LCC!$E$6))","v":0},null,"prodotto 5",0,{"$f":"IF(LCC!$M$28=1,LCC!$M$27,0)","v":0},{"$f":"IF(OR(LCC!$M$28=1,$E$24=2),LCC!$M$27,0)","v":0},{"$f":"IF(OR(LCC!$M$28=1,LCC!$M$28=3),LCC!$M$27,0)","v":0},{"$f":"IF(OR(LCC!$M$28=1,LCC!$M$28=2,LCC!$M$28=4),LCC!$M$27,0)","v":0},{"$f":"IF(OR(LCC!$M$28=1,LCC!$M$28=5),LCC!$M$27,0)","v":0},{"$f":"IF(OR(LCC!$M$28=1,LCC!$M$28=2,LCC!$M$28=3,LCC!$M$28=6),LCC!$M$27,0)","v":0},{"$f":"IF(OR(LCC!$M$28=1,LCC!$M$28=7),LCC!$M$27,0)","v":0},{"$f":"IF(OR(LCC!$M$28=1,LCC!$M$28=2,LCC!$M$28=4,LCC!$M$28=8),LCC!$M$27,0)","v":0},{"$f":"IF(OR(LCC!$M$28=1,LCC!$M$28=3,LCC!$M$28=9),LCC!$M$27,0)","v":0},{"$f":"IF(OR(LCC!$M$28=1,LCC!$M$28=2,LCC!$M$28=5,LCC!$M$28=10),LCC!$M$27,0)","v":0},{"$f":"SUM(AM89:INDEX(AM89:AW89,LCC!$E$6))","v":0}]
[null,null,null,null,null,null,null,null,null,null,null,null,null,null,null,null,null,null,null,null,null,null,null,"prodotto 3",0,{"$f":"IF(LCC!$I$28=1,LCC!$I$27,0)","v":0},{"$f":"IF(OR(LCC!$I$28=1,$E$24=2),LCC!$I$27,0)","v":0},{"$f":"IF(OR(LCC!$I$28=1,LCC!$I$28=3),LCC!$I$27,0)","v":0},{"$f":"IF(OR(LCC!$I$28=1,LCC!$I$28=2,LCC!$I$28=4),LCC!$I$27,0)","v":0},{"$f":"IF(OR(LCC!$I$28=1,LCC!$I$28=5),LCC!$I$27,0)","v":0},{"$f":"IF(OR(LCC!$I$28=1,LCC!$I$28=2,LCC!$I$28=3,LCC!$I$28=6),LCC!$I$27,0)","v":0},{"$f":"IF(OR(LCC!$I$28=1,LCC!$I$28=7),LCC!$I$27,0)","v":0},{"$f":"IF(OR(LCC!$I$28=1,LCC!$I$28=2,LCC!$I$28=4,LCC!$I$28=8),LCC!$I$27,0)","v":0},{"$f":"IF(OR(LCC!$I$28=1,LCC!$I$28=3,LCC!$I$28=9),LCC!$I$27,0)","v":0},{"$f":"IF(OR(LCC!$I$28=1,LCC!$I$28=2,LCC!$I$28=5,LCC!$I$28=10),LCC!$I$27,0)","v":0},{"$f":"SUM(Y90:INDEX(Y90:AI90,LCC!$E$6))","v":0},null,"prodotto 6",0,{"$f":"IF(LCC!$O$28=1,LCC!$O$27,0)","v":0},{"$f":"IF(OR(LCC!$O$28=1,$E$24=2),LCC!$O$27,0)","v":0},{"$f":"IF(OR(LCC!$O$28=1,LCC!$O$28=3),LCC!$O$27,0)","v":0},{"$f":"IF(OR(LCC!$O$28=1,LCC!$O$28=2,LCC!$O$28=4),LCC!$O$27,0)","v":0},{"$f":"IF(OR(LCC!$O$28=1,LCC!$O$28=5),LCC!$O$27,0)","v":0},{"$f":"IF(OR(LCC!$O$28=1,LCC!$O$28=2,LCC!$O$28=3,LCC!$O$28=6),LCC!$O$27,0)","v":0},{"$f":"IF(OR(LCC!$O$28=1,LCC!$O$28=7),LCC!$O$27,0)","v":0},{"$f":"IF(OR(LCC!$O$28=1,LCC!$O$28=2,LCC!$O$28=4,LCC!$O$28=8),LCC!$O$27,0)","v":0},{"$f":"IF(OR(LCC!$O$28=1,LCC!$O$28=3,LCC!$O$28=9),LCC!$O$27,0)","v":0},{"$f":"IF(OR(LCC!$O$28=1,LCC!$O$28=2,LCC!$O$28=5,LCC!$O$28=10),LCC!$O$27,0)","v":0},{"$f":"SUM(AM90:INDEX(AM90:AW90,LCC!$E$6))","v":0}]
[null,null,null,null,null,null,null,null,null,null,null,null,null,null,null,null,null,null,null,null,null,null,null,"prodotto 4",0,{"$f":"IF(LCC!$K$28=1,LCC!$K$27,0)","v":0},{"$f":"IF(OR(LCC!$K$28=1,$E$24=2),LCC!$K$27,0)","v":0},{"$f":"IF(OR(LCC!$K$28=1,LCC!$K$28=3),LCC!$K$27,0)","v":0},{"$f":"IF(OR(LCC!$K$28=1,LCC!$K$28=2,LCC!$K$28=4),LCC!$K$27,0)","v":0},{"$f":"IF(OR(LCC!$K$28=1,LCC!$K$28=5),LCC!$K$27,0)","v":0},{"$f":"IF(OR(LCC!$K$28=1,LCC!$K$28=2,LCC!$K$28=3,LCC!$K$28=6),LCC!$K$27,0)","v":0},{"$f":"IF(OR(LCC!$K$28=1,LCC!$K$28=7),LCC!$K$27,0)","v":0},{"$f":"IF(OR(LCC!$K$28=1,LCC!$K$28=2,LCC!$K$28=4,LCC!$K$28=8),LCC!$K$27,0)","v":0},{"$f":"IF(OR(LCC!$K$28=1,LCC!$K$28=3,LCC!$K$28=9),LCC!$K$27,0)","v":0},{"$f":"IF(OR(LCC!$K$28=1,LCC!$K$28=2,LCC!$K$28=5,LCC!$K$28=10),LCC!$K$27,0)","v":0},{"$f":"SUM(Y91:INDEX(Y91:AI91,LCC!$E$6))","v":0},null,"prodotto 7",0,{"$f":"IF(LCC!$Q$28=1,LCC!$Q$27,0)","v":0},{"$f":"IF(OR(LCC!$Q$28=1,$E$24=2),LCC!$Q$27,0)","v":0},{"$f":"IF(OR(LCC!$Q$28=1,LCC!$Q$28=3),LCC!$Q$27,0)","v":0},{"$f":"IF(OR(LCC!$Q$28=1,LCC!$Q$28=2,LCC!$Q$28=4),LCC!$Q$27,0)","v":0},{"$f":"IF(OR(LCC!$Q$28=1,LCC!$Q$28=5),LCC!$Q$27,0)","v":0},{"$f":"IF(OR(LCC!$Q$28=1,LCC!$Q$28=2,LCC!$Q$28=3,LCC!$Q$28=6),LCC!$Q$27,0)","v":0},{"$f":"IF(OR(LCC!$Q$28=1,LCC!$Q$28=7),LCC!$Q$27,0)","v":0},{"$f":"IF(OR(LCC!$Q$28=1,LCC!$Q$28=2,LCC!$Q$28=4,LCC!$Q$28=8),LCC!$Q$27,0)","v":0},{"$f":"IF(OR(LCC!$Q$28=1,LCC!$Q$28=3,LCC!$Q$28=9),LCC!$Q$27,0)","v":0},{"$f":"IF(OR(LCC!$Q$28=1,LCC!$Q$28=2,LCC!$Q$28=5,LCC!$Q$28=10),LCC!$Q$27,0)","v":0},{"$f":"SUM(AM91:INDEX(AM91:AW91,LCC!$E$6))","v":0}]
[null,null,null,null,null,null,null,null,null,null,null,null,null,null,null,null,null,null,null,null,null,null,null,"prodotto 5",0,{"$f":"IF(LCC!$M$28=1,LCC!$M$27,0)","v":0},{"$f":"IF(OR(LCC!$M$28=1,$E$24=2),LCC!$M$27,0)","v":0},{"$f":"IF(OR(LCC!$M$28=1,LCC!$M$28=3),LCC!$M$27,0)","v":0},{"$f":"IF(OR(LCC!$M$28=1,LCC!$M$28=2,LCC!$M$28=4),LCC!$M$27,0)","v":0},{"$f":"IF(OR(LCC!$M$28=1,LCC!$M$28=5),LCC!$M$27,0)","v":0},{"$f":"IF(OR(LCC!$M$28=1,LCC!$M$28=2,LCC!$M$28=3,LCC!$M$28=6),LCC!$M$27,0)","v":0},{"$f":"IF(OR(LCC!$M$28=1,LCC!$M$28=7),LCC!$M$27,0)","v":0},{"$f":"IF(OR(LCC!$M$28=1,LCC!$M$28=2,LCC!$M$28=4,LCC!$M$28=8),LCC!$M$27,0)","v":0},{"$f":"IF(OR(LCC!$M$28=1,LCC!$M$28=3,LCC!$M$28=9),LCC!$M$27,0)","v":0},{"$f":"IF(OR(LCC!$M$28=1,LCC!$M$28=2,LCC!$M$28=5,LCC!$M$28=10),LCC!$M$27,0)","v":0},{"$f":"SUM(Y92:INDEX(Y92:AI92,LCC!$E$6))","v":0},null,"prodotto 8",0,{"$f":"IF(LCC!$S$28=1,LCC!$S$27,0)","v":0},{"$f":"IF(OR(LCC!$S$28=1,$E$24=2),LCC!$S$27,0)","v":0},{"$f":"IF(OR(LCC!$S$28=1,LCC!$S$28=3),LCC!$S$27,0)","v":0},{"$f":"IF(OR(LCC!$S$28=1,LCC!$S$28=2,LCC!$S$28=4),LCC!$S$27,0)","v":0},{"$f":"IF(OR(LCC!$S$28=1,LCC!$S$28=5),LCC!$S$27,0)","v":0},{"$f":"IF(OR(LCC!$S$28=1,LCC!$S$28=2,LCC!$S$28=3,LCC!$S$28=6),LCC!$S$27,0)","v":0},{"$f":"IF(OR(LCC!$S$28=1,LCC!$S$28=7),LCC!$S$27,0)","v":0},{"$f":"IF(OR(LCC!$S$28=1,LCC!$S$28=2,LCC!$S$28=4,LCC!$S$28=8),LCC!$S$27,0)","v":0},{"$f":"IF(OR(LCC!$S$28=1,LCC!$S$28=3,LCC!$S$28=9),LCC!$S$27,0)","v":0},{"$f":"IF(OR(LCC!$S$28=1,LCC!$S$28=2,LCC!$S$28=5,LCC!$S$28=10),LCC!$S$27,0)","v":0},{"$f":"SUM(AM92:INDEX(AM92:AW92,LCC!$E$6))","v":0}]
[null,null,null,null,null,null,null,null,null,null,null,null,null,null,null,null,null,null,null,null,null,null,null,"prodotto 6",0,{"$f":"IF(LCC!$O$28=1,LCC!$O$27,0)","v":0},{"$f":"IF(OR(LCC!$O$28=1,$E$24=2),LCC!$O$27,0)","v":0},{"$f":"IF(OR(LCC!$O$28=1,LCC!$O$28=3),LCC!$O$27,0)","v":0},{"$f":"IF(OR(LCC!$O$28=1,LCC!$O$28=2,LCC!$O$28=4),LCC!$O$27,0)","v":0},{"$f":"IF(OR(LCC!$O$28=1,LCC!$O$28=5),LCC!$O$27,0)","v":0},{"$f":"IF(OR(LCC!$O$28=1,LCC!$O$28=2,LCC!$O$28=3,LCC!$O$28=6),LCC!$O$27,0)","v":0},{"$f":"IF(OR(LCC!$O$28=1,LCC!$O$28=7),LCC!$O$27,0)","v":0},{"$f":"IF(OR(LCC!$O$28=1,LCC!$O$28=2,LCC!$O$28=4,LCC!$O$28=8),LCC!$O$27,0)","v":0},{"$f":"IF(OR(LCC!$O$28=1,LCC!$O$28=3,LCC!$O$28=9),LCC!$O$27,0)","v":0},{"$f":"IF(OR(LCC!$O$28=1,LCC!$O$28=2,LCC!$O$28=5,LCC!$O$28=10),LCC!$O$27,0)","v":0},{"$f":"SUM(Y93:INDEX(Y93:AI93,LCC!$E$6))","v":0},null,"prodotto 9",0,{"$f":"IF(LCC!$U$28=1,LCC!$U$27,0)","v":0},{"$f":"IF(OR(LCC!$U$28=1,$E$24=2),LCC!$U$27,0)","v":0},{"$f":"IF(OR(LCC!$U$28=1,LCC!$U$28=3),LCC!$U$27,0)","v":0},{"$f":"IF(OR(LCC!$U$28=1,LCC!$U$28=2,LCC!$U$28=4),LCC!$U$27,0)","v":0},{"$f":"IF(OR(LCC!$U$28=1,LCC!$U$28=5),LCC!$U$27,0)","v":0},{"$f":"IF(OR(LCC!$U$28=1,LCC!$U$28=2,LCC!$U$28=3,LCC!$U$28=6),LCC!$U$27,0)","v":0},{"$f":"IF(OR(LCC!$U$28=1,LCC!$U$28=7),LCC!$U$27,0)","v":0},{"$f":"IF(OR(LCC!$U$28=1,LCC!$U$28=2,LCC!$U$28=4,LCC!$U$28=8),LCC!$U$27,0)","v":0},{"$f":"IF(OR(LCC!$U$28=1,LCC!$U$28=3,LCC!$U$28=9),LCC!$U$27,0)","v":0},{"$f":"IF(OR(LCC!$U$28=1,LCC!$U$28=2,LCC!$U$28=5,LCC!$U$28=10),LCC!$U$27,0)","v":0},{"$f":"SUM(AM93:INDEX(AM93:AW93,LCC!$E$6))","v":0}]
[null,null,null,null,null,null,null,null,null,null,null,null,null,null,null,null,null,null,null,null,null,null,null,"prodotto 7",0,{"$f":"IF(LCC!$Q$28=1,LCC!$Q$27,0)","v":0},{"$f":"IF(OR(LCC!$Q$28=1,$E$24=2),LCC!$Q$27,0)","v":0},{"$f":"IF(OR(LCC!$Q$28=1,LCC!$Q$28=3),LCC!$Q$27,0)","v":0},{"$f":"IF(OR(LCC!$Q$28=1,LCC!$Q$28=2,LCC!$Q$28=4),LCC!$Q$27,0)","v":0},{"$f":"IF(OR(LCC!$Q$28=1,LCC!$Q$28=5),LCC!$Q$27,0)","v":0},{"$f":"IF(OR(LCC!$Q$28=1,LCC!$Q$28=2,LCC!$Q$28=3,LCC!$Q$28=6),LCC!$Q$27,0)","v":0},{"$f":"IF(OR(LCC!$Q$28=1,LCC!$Q$28=7),LCC!$Q$27,0)","v":0},{"$f":"IF(OR(LCC!$Q$28=1,LCC!$Q$28=2,LCC!$Q$28=4,LCC!$Q$28=8),LCC!$Q$27,0)","v":0},{"$f":"IF(OR(LCC!$Q$28=1,LCC!$Q$28=3,LCC!$Q$28=9),LCC!$Q$27,0)","v":0},{"$f":"IF(OR(LCC!$Q$28=1,LCC!$Q$28=2,LCC!$Q$28=5,LCC!$Q$28=10),LCC!$Q$27,0)","v":0},{"$f":"SUM(Y94:INDEX(Y94:AI94,LCC!$E$6))","v":0},null,"prodotto 10",0,{"$f":"IF(LCC!$W$28=1,LCC!$W$27,0)","v":0},{"$f":"IF(OR(LCC!$W$28=1,$E$24=2),LCC!$W$27,0)","v":0},{"$f":"IF(OR(LCC!$W$28=1,LCC!$W$28=3),LCC!$W$27,0)","v":0},{"$f":"IF(OR(LCC!$W$28=1,LCC!$W$28=2,LCC!$W$28=4),LCC!$W$27,0)","v":0},{"$f":"IF(OR(LCC!$W$28=1,LCC!$W$28=5),LCC!$W$27,0)","v":0},{"$f":"IF(OR(LCC!$W$28=1,LCC!$W$28=2,LCC!$W$28=3,LCC!$W$28=6),LCC!$W$27,0)","v":0},{"$f":"IF(OR(LCC!$W$28=1,LCC!$W$28=7),LCC!$W$27,0)","v":0},{"$f":"IF(OR(LCC!$W$28=1,LCC!$W$28=2,LCC!$W$28=4,LCC!$W$28=8),LCC!$W$27,0)","v":0},{"$f":"IF(OR(LCC!$W$28=1,LCC!$W$28=3,LCC!$W$28=9),LCC!$W$27,0)","v":0},{"$f":"IF(OR(LCC!$W$28=1,LCC!$W$28=2,LCC!$W$28=5,LCC!$W$28=10),LCC!$W$27,0)","v":0},{"$f":"SUM(AM94:INDEX(AM94:AW94,LCC!$E$6))","v":0}]
[null,null,null,null,null,null,null,null,null,null,null,null,null,null,null,null,null,null,null,null,null,null,null,"prodotto 8",0,{"$f":"IF(LCC!$S$28=1,LCC!$S$27,0)","v":0},{"$f":"IF(OR(LCC!$S$28=1,$E$24=2),LCC!$S$27,0)","v":0},{"$f":"IF(OR(LCC!$S$28=1,LCC!$S$28=3),LCC!$S$27,0)","v":0},{"$f":"IF(OR(LCC!$S$28=1,LCC!$S$28=2,LCC!$S$28=4),LCC!$S$27,0)","v":0},{"$f":"IF(OR(LCC!$S$28=1,LCC!$S$28=5),LCC!$S$27,0)","v":0},{"$f":"IF(OR(LCC!$S$28=1,LCC!$S$28=2,LCC!$S$28=3,LCC!$S$28=6),LCC!$S$27,0)","v":0},{"$f":"IF(OR(LCC!$S$28=1,LCC!$S$28=7),LCC!$S$27,0)","v":0},{"$f":"IF(OR(LCC!$S$28=1,LCC!$S$28=2,LCC!$S$28=4,LCC!$S$28=8),LCC!$S$27,0)","v":0},{"$f":"IF(OR(LCC!$S$28=1,LCC!$S$28=3,LCC!$S$28=9),LCC!$S$27,0)","v":0},{"$f":"IF(OR(LCC!$S$28=1,LCC!$S$28=2,LCC!$S$28=5,LCC!$S$28=10),LCC!$S$27,0)","v":0},{"$f":"SUM(Y95:INDEX(Y95:AI95,LCC!$E$6))","v":0}]
[null,null,null,null,null,null,null,null,null,null,null,null,null,null,null,null,null,null,null,null,null,null,null,"prodotto 9",0,{"$f":"IF(LCC!$U$28=1,LCC!$U$27,0)","v":0},{"$f":"IF(OR(LCC!$U$28=1,$E$24=2),LCC!$U$27,0)","v":0},{"$f":"IF(OR(LCC!$U$28=1,LCC!$U$28=3),LCC!$U$27,0)","v":0},{"$f":"IF(OR(LCC!$U$28=1,LCC!$U$28=2,LCC!$U$28=4),LCC!$U$27,0)","v":0},{"$f":"IF(OR(LCC!$U$28=1,LCC!$U$28=5),LCC!$U$27,0)","v":0},{"$f":"IF(OR(LCC!$U$28=1,LCC!$U$28=2,LCC!$U$28=3,LCC!$U$28=6),LCC!$U$27,0)","v":0},{"$f":"IF(OR(LCC!$U$28=1,LCC!$U$28=7),LCC!$U$27,0)","v":0},{"$f":"IF(OR(LCC!$U$28=1,LCC!$U$28=2,LCC!$U$28=4,LCC!$U$28=8),LCC!$U$27,0)","v":0},{"$f":"IF(OR(LCC!$U$28=1,LCC!$U$28=3,LCC!$U$28=9),LCC!$U$27,0)","v":0},{"$f":"IF(OR(LCC!$U$28=1,LCC!$U$28=2,LCC!$U$28=5,LCC!$U$28=10),LCC!$U$27,0)","v":0},{"$f":"SUM(Y96:INDEX(Y96:AI96,LCC!$E$6))","v":0}]
[null,null,null,null,null,null,null,null,null,null,null,null,null,null,null,null,null,null,null,null,null,null,null,"prodotto 10",0,{"$f":"IF(LCC!$W$28=1,LCC!$W$27,0)","v":0},{"$f":"IF(OR(LCC!$W$28=1,$E$24=2),LCC!$W$27,0)","v":0},{"$f":"IF(OR(LCC!$W$28=1,LCC!$W$28=3),LCC!$W$27,0)","v":0},{"$f":"IF(OR(LCC!$W$28=1,LCC!$W$28=2,LCC!$W$28=4),LCC!$W$27,0)","v":0},{"$f":"IF(OR(LCC!$W$28=1,LCC!$W$28=5),LCC!$W$27,0)","v":0},{"$f":"IF(OR(LCC!$W$28=1,LCC!$W$28=2,LCC!$W$28=3,LCC!$W$28=6),LCC!$W$27,0)","v":0},{"$f":"IF(OR(LCC!$W$28=1,LCC!$W$28=7),LCC!$W$27,0)","v":0},{"$f":"IF(OR(LCC!$W$28=1,LCC!$W$28=2,LCC!$W$28=4,LCC!$W$28=8),LCC!$W$27,0)","v":0},{"$f":"IF(OR(LCC!$W$28=1,LCC!$W$28=3,LCC!$W$28=9),LCC!$W$27,0)","v":0},{"$f":"IF(OR(LCC!$W$28=1,LCC!$W$28=2,LCC!$W$28=5,LCC!$W$28=10),LCC!$W$27,0)","v":0},{"$f":"SUM(Y97:INDEX(Y97:AI97,LCC!$E$6))","v":0}]

{"sheet":"calcoli","index":4,"n_rows":59,"n_cols":16,"rows_kept":59,"cut":false,"hidden":true,"merged":[]}
["FOR CALCULATIONS ONLY - DO NOT AMEND!"]
[]
[null,null,null,"prodotto 1","prodotto 2","prodotto 3","prodotto 4","prodotto 5","prodotto 6","prodotto 7","prodotto 8","prodotto 9","prodotto 10"]
[null,null,"tipo di carburante",{"$f":"MATCH(LCC!E20,$B$26:$B$38,0)","v":{"$error":"#N/A"}},{"$f":"MATCH(LCC!G20,$B$26:$B$38,0)","v":{"$error":"#N/A"}},{"$f":"MATCH(LCC!I20,$B$26:$B$38,0)","v":{"$error":"#N/A"}},{"$f":"MATCH(LCC!K20,$B$26:$B$38,0)","v":{"$error":"#N/A"}},{"$f":"MATCH(LCC!M20,$B$26:$B$38,0)","v":{"$error":"#N/A"}},{"$f":"MATCH(LCC!O20,$B$26:$B$38,0)","v":{"$error":"#N/A"}},{"$f":"MATCH(LCC!Q20,$B$26:$B$38,0)","v":{"$error":"#N/A"}},{"$f":"MATCH(LCC!S20,$B$26:$B$38,0)","v":{"$error":"#N/A"}},{"$f":"MATCH(LCC!U20,$B$26:$B$38,0)","v":{"$error":"#N/A"}},{"$f":"MATCH(LCC!W20,$B$26:$B$38,0)","v":{"$error":"#N/A"}}]
[null,null,"tipo di carburante 2",{"$f":"IF(CELL(\"contents\",LCC!E24)>0,MATCH(LCC!E24,$B$26:$B$38,0),0)","v":0},{"$f":"IF(CELL(\"contents\",LCC!G24)>0,MATCH(LCC!G24,$B$26:$B$38,0),0)","v":0},{"$f":"IF(CELL(\"contents\",LCC!I24)>0,MATCH(LCC!I24,$B$26:$B$38,0),0)","v":0},{"$f":"IF(CELL(\"contents\",LCC!K24)>0,MATCH(LCC!K24,$B$26:$B$38,0),0)","v":0},{"$f":"IF(CELL(\"contents\",LCC!M24)>0,MATCH(LCC!M24,$B$26:$B$38,0),0)","v":0},{"$f":"IF(CELL(\"contents\",LCC!O24)>0,MATCH(LCC!O24,$B$26:$B$38,0),0)","v":0},{"$f":"IF(CELL(\"contents\",LCC!Q24)>0,MATCH(LCC!Q24,$B$26:$B$38,0),0)","v":0},{"$f":"IF(CELL(\"contents\",LCC!S24)>0,MATCH(LCC!S24,$B$26:$B$38,0),0)","v":0},{"$f":"IF(CELL(\"contents\",LCC!U24)>0,MATCH(LCC!U24,$B$26:$B$38,0),0)","v":0},{"$f":"IF(CELL(\"contents\",LCC!W24)>0,MATCH(LCC!W24,$B$26:$B$38,0),0)","v":0}]
[null,null,"carburante di riferimento (1 = diesel, 2 = benzina)",{"$f":"IF(LCC!E59>0,IF(LCC!E59=\"Diesel\",1,2),0)","v":0},{"$f":"IF(LCC!G59>0,IF(LCC!G59=\"Diesel\",1,2),0)","v":0},{"$f":"IF(LCC!I59>0,IF(LCC!I59=\"Diesel\",1,2),0)","v":0},{"$f":"IF(LCC!K59>0,IF(LCC!K59=\"Diesel\",1,2),0)","v":0},{"$f":"IF(LCC!M59>0,IF(LCC!M59=\"Diesel\",1,2),0)","v":0},{"$f":"IF(LCC!O59>0,IF(LCC!O59=\"Diesel\",1,2),0)","v":0},{"$f":"IF(LCC!Q59>0,IF(LCC!Q59=\"Diesel\",1,2),0)","v":0},{"$f":"IF(LCC!S59>0,IF(LCC!S59=\"Diesel\",1,2),0)","v":0},{"$f":"IF(LCC!U59>0,IF(LCC!U59=\"Diesel\",1,2),0)","v":0},{"$f":"IF(LCC!W59>0,IF(LCC!W59=\"Diesel\",1,2),0)","v":0}]
[null,null,"carburante 1",{"$f":"INDEX(G$26:G$38,D4)/LCC!$E$6","v":{"$error":"#N/A"}},{"$f":"INDEX(H$26:H$38,E4)/LCC!$E$6","v":{"$error":"#N/A"}},{"$f":"INDEX(I$26:I$38,F4)/LCC!$E$6","v":{"$error":"#N/A"}},{"$f":"INDEX(J$26:J$38,G4)/LCC!$E$6","v":{"$error":"#N/A"}},{"$f":"INDEX(K$26:K$38,H4)/LCC!$E$6","v":{"$error":"#N/A"}},{"$f":"INDEX(L$26:L$38,I4)/LCC!$E$6","v":{"$error":"#N/A"}},{"$f":"INDEX(M$26:M$38,J4)/LCC!$E$6","v":{"$error":"#N/A"}},{"$f":"INDEX(N$26:N$38,K4)/LCC!$E$6","v":{"$error":"#N/A"}},{"$f":"INDEX(O$26:O$38,L4)/LCC!$E$6","v":{"$error":"#N/A"}},{"$f":"INDEX(P$26:P$38,M4)/LCC!$E$6","v":{"$error":"#N/A"}}]
[null,null,"carburante 2",{"$f":"IF(LCC!E23=\"Yes\",INDEX(G$42:G$54,D5)/LCC!$E$6,0)","v":0},{"$f":"IF(LCC!G23=\"Yes\",INDEX(H$42:H$54,E5)/LCC!$E$6,0)","v":0},{"$f":"IF(LCC!I23=\"Yes\",INDEX(I$42:I$54,F5)/LCC!$E$6,0)","v":0},{"$f":"IF(LCC!K23=\"Yes\",INDEX(J$42:J$54,G5)/LCC!$E$6,0)","v":0},{"$f":"IF(LCC!M23=\"Yes\",INDEX(K$42:K$54,H5)/LCC!$E$6,0)","v":0},{"$f":"IF(LCC!O23=\"Yes\",INDEX(L$42:L$54,I5)/LCC!$E$6,0)","v":0},{"$f":"IF(LCC!Q23=\"Yes\",INDEX(M$42:M$54,J5)/LCC!$E$6,0)","v":0},{"$f":"IF(LCC!S23=\"Yes\",INDEX(N$42:N$54,K5)/LCC!$E$6,0)","v":0},{"$f":"IF(LCC!U23=\"Yes\",INDEX(O$42:O$54,L5)/LCC!$E$6,0)","v":0},{"$f":"IF(LCC!W23=\"Yes\",INDEX(P$42:P$54,M5)/LCC!$E$6,0)","v":0}]
[null,null,"pagamento per periodo di carburante",{"$f":"SUM(D7:D8)","v":{"$error":"#N/A"}},{"$error":"#N/A"},{"$error":"#N/A"},{"$error":"#N/A"},{"$error":"#N/A"},{"$error":"#N/A"},{"$error":"#N/A"},{"$error":"#N/A"},{"$error":"#N/A"},{"$error":"#N/A"}]
[null,null,"prezzo medio annuale batteria",{"$f":"'prezzi combustibile'!AJ88/LCC!$E$6","v":{"$error":"#DIV/0!"}},{"$f":"'prezzi combustibile'!AJ89/LCC!$E$6","v":{"$error":"#DIV/0!"}},{"$f":"'prezzi combustibile'!AJ90/LCC!$E$6","v":{"$error":"#DIV/0!"}},{"$f":"'prezzi combustibile'!AJ91/LCC!$E$6","v":{"$error":"#DIV/0!"}},{"$f":"'prezzi combustibile'!AJ92/LCC!$E$6","v":{"$error":"#DIV/0!"}},{"$f":"'prezzi combustibile'!AJ93/LCC!$E$6","v":{"$error":"#DIV/0!"}},{"$f":"'prezzi combustibile'!AJ94/LCC!$E$6","v":{"$error":"#DIV/0!"}},{"$f":"'prezzi combustibile'!AJ95/LCC!$E$6","v":{"$error":"#DIV/0!"}},{"$f":"'prezzi combustibile'!AJ96/LCC!$E$6","v":{"$error":"#DIV/0!"}},{"$f":"'prezzi combustibile'!AJ97/LCC!$E$6","v":{"$error":"#DIV/0!"}}]
[null,null,"prezzo carburante per litro scegliendo i valori (carburante 1)",{"$f":"IF(INDEX(LCC!$C$84:$D$96,calcoli!D4,2)>0,LCC!$E$22-CUMIPMT(INDEX(LCC!$C$84:$D$96,calcoli!D4,2),LCC!$E$6,LCC!$E$22,1,LCC!$E$6,1),LCC!$E$22*(1+(INDEX(LCC!$C$84:$D$95,calcoli!D4,2))^LCC!$E$6))","v":{"$error":"#N/A"}},{"$f":"IF(INDEX(LCC!$C$84:$D$96,calcoli!E4,2)>0,LCC!$G$22-CUMIPMT(INDEX(LCC!$C$84:$D$96,calcoli!E4,2),LCC!$E$6,LCC!$G$22,1,LCC!$E$6,1),LCC!$G$22*(1+(INDEX(LCC!$C$84:$D$95,calcoli!E4,2))^LCC!$E$6))","v":{"$error":"#N/A"}},{"$f":"IF(INDEX(LCC!$C$84:$D$96,calcoli!F4,2)>0,LCC!$I$22-CUMIPMT(INDEX(LCC!$C$84:$D$96,calcoli!F4,2),LCC!$E$6,LCC!$I$22,1,LCC!$E$6,1),LCC!$I$22*(1+(INDEX(LCC!$C$84:$D$95,calcoli!F4,2))^LCC!$E$6))","v":{"$error":"#N/A"}},{"$f":"IF(INDEX(LCC!$C$84:$D$96,calcoli!G4,2)>0,LCC!$K$22-CUMIPMT(INDEX(LCC!$C$84:$D$96,calcoli!G4,2),LCC!$E$6,LCC!$K$22,1,LCC!$E$6,1),LCC!$K$22*(1+(INDEX(LCC!$C$84:$D$95,calcoli!G4,2))^LCC!$E$6))","v":{"$error":"#N/A"}},{"$f":"IF(INDEX(LCC!$C$84:$D$96,calcoli!H4,2)>0,LCC!$M$22-CUMIPMT(INDEX(LCC!$C$84:$D$96,calcoli!H4,2),LCC!$E$6,LCC!$M$22,1,LCC!$E$6,1),LCC!$M$22*(1+(INDEX(LCC!$C$84:$D$95,calcoli!H4,2))^LCC!$E$6))","v":{"$error":"#N/A"}},{"$f":"IF(INDEX(LCC!$C$84:$D$96,calcoli!I4,2)>0,LCC!$O$22-CUMIPMT(INDEX(LCC!$C$84:$D$96,calcoli!I4,2),LCC!$E$6,LCC!$O$22,1,LCC!$E$6,1),LCC!$O$22*(1+(INDEX(LCC!$C$84:$D$95,calcoli!I4,2))^LCC!$E$6))","v":{"$error":"#N/A"}},{"$f":"IF(INDEX(LCC!$C$84:$D$96,calcoli!J4,2)>0,LCC!$Q$22-CUMIPMT(INDEX(LCC!$C$84:$D$96,calcoli!J4,2),LCC!$E$6,LCC!$Q$22,1,LCC!$E$6,1),LCC!$Q$22*(1+(INDEX(LCC!$C$84:$D$95,calcoli!J4,2))^LCC!$E$6))","v":{"$error":"#N/A"}},{"$f":"IF(INDEX(LCC!$C$84:$D$96,calcoli!K4,2)>0,LCC!$S$22-CUMIPMT(INDEX(LCC!$C$84:$D$96,calcoli!K4,2),LCC!$E$6,LCC!$S$22,1,LCC!$E$6,1),LCC!$S$22*(1+(INDEX(LCC!$C$84:$D$95,calcoli!K4,2))^LCC!$E$6))","v":{"$error":"#N/A"}},{"$f":"IF(INDEX(LCC!$C$84:$D$96,calcoli!L4,2)>0,LCC!$U$22-CUMIPMT(INDEX(LCC!$C$84:$D$96,calcoli!L4,2),LCC!$E$6,LCC!$U$22,1,LCC!$E$6,1),LCC!$U$22*(1+(INDEX(LCC!$C$84:$D$95,calcoli!L4,2))^LCC!$E$6))","v":{"$error":"#N/A"}},{"$f":"IF(INDEX(LCC!$C$84:$D$96,calcoli!M4,2)>0,LCC!$W$22-CUMIPMT(INDEX(LCC!$C$84:$D$96,calcoli!M4,2),LCC!$E$6,LCC!$W$22,1,LCC!$E$6,1),LCC!$W$22*(1+(INDEX(LCC!$C$84:$D$95,calcoli!M4,2))^LCC!$E$6))","v":{"$error":"#N/A"}}]
[null,null,"prezzo carburante per litro scegliendo i valori (carburante 2)",{"$f":"IF(CELL(\"contents\",D5)>0,IF(INDEX(LCC!$C$84:$D$96,calcoli!D5,2)>0,LCC!$E$26-CUMIPMT(INDEX(LCC!$C$84:$D$96,calcoli!D5,2),LCC!$E$6,LCC!$E$26,1,LCC!$E$6,1),LCC!$E$26*(1+(INDEX(LCC!$C$84:$D$95,calcoli!D5,2))^LCC!$E$6)),0)","v":0},{"$f":"IF(CELL(\"contents\",E5)>0,IF(INDEX(LCC!$C$84:$D$96,calcoli!E5,2)>0,LCC!G26-CUMIPMT(INDEX(LCC!$C$84:$D$96,calcoli!E5,2),LCC!$E$6,LCC!G26,1,LCC!$E$6,1),LCC!G26*(1+(INDEX(LCC!$C$84:$D$95,calcoli!E5,2))^LCC!$E$6)),0)","v":0},{"$f":"IF(CELL(\"contents\",F5)>0,IF(INDEX(LCC!$C$84:$D$96,calcoli!F5,2)>0,LCC!I26-CUMIPMT(INDEX(LCC!$C$84:$D$96,calcoli!F5,2),LCC!$E$6,LCC!I26,1,LCC!$E$6,1),LCC!I26*(1+(INDEX(LCC!$C$84:$D$95,calcoli!F5,2))^LCC!$E$6)),0)","v":0},{"$f":"IF(CELL(\"contents\",G5)>0,IF(INDEX(LCC!$C$84:$D$96,calcoli!G5,2)>0,LCC!K26-CUMIPMT(INDEX(LCC!$C$84:$D$96,calcoli!G5,2),LCC!$E$6,LCC!K26,1,LCC!$E$6,1),LCC!K26*(1+(INDEX(LCC!$C$84:$D$95,calcoli!G5,2))^LCC!$E$6)),0)","v":0},{"$f":"IF(CELL(\"contents\",H5)>0,IF(INDEX(LCC!$C$84:$D$96,calcoli!H5,2)>0,LCC!M26-CUMIPMT(INDEX(LCC!$C$84:$D$96,calcoli!H5,2),LCC!$E$6,LCC!M26,1,LCC!$E$6,1),LCC!M26*(1+(INDEX(LCC!$C$84:$D$95,calcoli!H5,2))^LCC!$E$6)),0)","v":0},{"$f":"IF(CELL(\"contents\",I5)>0,IF(INDEX(LCC!$C$84:$D$96,calcoli!I5,2)>0,LCC!O26-CUMIPMT(INDEX(LCC!$C$84:$D$96,calcoli!I5,2),LCC!$E$6,LCC!O26,1,LCC!$E$6,1),LCC!O26*(1+(INDEX(LCC!$C$84:$D$95,calcoli!I5,2))^LCC!$E$6)),0)","v":0},{"$f":"IF(CELL(\"contents\",J5)>0,IF(INDEX(LCC!$C$84:$D$96,calcoli!J5,2)>0,LCC!Q26-CUMIPMT(INDEX(LCC!$C$84:$D$96,calcoli!J5,2),LCC!$E$6,LCC!Q26,1,LCC!$E$6,1),LCC!Q26*(1+(INDEX(LCC!$C$84:$D$95,calcoli!J5,2))^LCC!$E$6)),0)","v":0},{"$f":"IF(CELL(\"contents\",K5)>0,IF(INDEX(LCC!$C$84:$D$96,calcoli!K5,2)>0,LCC!S26-CUMIPMT(INDEX(LCC!$C$84:$D$96,calcoli!K5,2),LCC!$E$6,LCC!S26,1,LCC!$E$6,1),LCC!S26*(1+(INDEX(LCC!$C$84:$D$95,calcoli!K5,2))^LCC!$E$6)),0)","v":0},{"$f":"IF(CELL(\"contents\",L5)>0,IF(INDEX(LCC!$C$84:$D$96,calcoli!L5,2)>0,LCC!U26-CUMIPMT(INDEX(LCC!$C$84:$D$96,calcoli!L5,2),LCC!$E$6,LCC!U26,1,LCC!$E$6,1),LCC!U26*(1+(INDEX(LCC!$C$84:$D$95,calcoli!L5,2))^LCC!$E$6)),0)","v":0},{"$f":"IF(CELL(\"contents\",M5)>0,IF(INDEX(LCC!$C$84:$D$96,calcoli!M5,2)>0,LCC!W26-CUMIPMT(INDEX(LCC!$C$84:$D$96,calcoli!M5,2),LCC!$E$6,LCC!W26,1,LCC!$E$6,1),LCC!W26*(1+(INDEX(LCC!$C$84:$D$95,calcoli!M5,2))^LCC!$E$6)),0)","v":0}]
[null,null,"carburante consumption per vehicle (carburante 1)",{"$f":"LCC!E$21","v":0},{"$f":"LCC!G$21","v":0},{"$f":"LCC!I$21","v":0},{"$f":"LCC!K$21","v":0},{"$f":"LCC!M$21","v":0},{"$f":"LCC!O$21","v":0},{"$f":"LCC!Q$21","v":0},{"$f":"LCC!S$21","v":0},{"$f":"LCC!U$21","v":0},{"$f":"LCC!W$21","v":0}]
[null,null,"contenuto energetico (carburante 1)",{"$f":"IF(CELL(\"contents\",LCC!E22)>0,INDEX($C$26:$C$38,D$4),0)","v":0},{"$f":"IF(CELL(\"contents\",LCC!G22)>0,INDEX($C$26:$C$38,E$4),0)","v":0},{"$f":"IF(CELL(\"contents\",LCC!I22)>0,INDEX($C$26:$C$38,F$4),0)","v":0},{"$f":"IF(CELL(\"contents\",LCC!K22)>0,INDEX($C$26:$C$38,G$4),0)","v":0},{"$f":"IF(CELL(\"contents\",LCC!M22)>0,INDEX($C$26:$C$38,H$4),0)","v":0},{"$f":"IF(CELL(\"contents\",LCC!O22)>0,INDEX($C$26:$C$38,I$4),0)","v":0},{"$f":"IF(CELL(\"contents\",LCC!Q22)>0,INDEX($C$26:$C$38,J$4),0)","v":0},{"$f":"IF(CELL(\"contents\",LCC!S22)>0,INDEX($C$26:$C$38,K$4),0)","v":0},{"$f":"IF(CELL(\"contents\",LCC!U22)>0,INDEX($C$26:$C$38,L$4),0)","v":0},{"$f":"IF(CELL(\"contents\",LCC!W22)>0,INDEX($C$26:$C$38,M$4),0)","v":0}]
[null,null,"consumo carburante per veicolo (carburante 2)",{"$f":"LCC!E$25","v":0},{"$f":"LCC!G$25","v":0},{"$f":"LCC!I$25","v":0},{"$f":"LCC!K$25","v":0},{"$f":"LCC!M$25","v":0},{"$f":"LCC!O$25","v":0},{"$f":"LCC!Q$25","v":0},{"$f":"LCC!S$25","v":0},{"$f":"LCC!U$25","v":0},{"$f":"LCC!W$25","v":0}]
[null,null,"contenuto energetico (carburante 2)",{"$f":"IF(CELL(\"contents\",LCC!E26)>0,INDEX($C$42:$C$54,D$5),0)","v":0},{"$f":"IF(CELL(\"contents\",LCC!G26)>0,INDEX($C$42:$C$54,E$5),0)","v":0},{"$f":"IF(CELL(\"contents\",LCC!I26)>0,INDEX($C$42:$C$54,F$5),0)","v":0},{"$f":"IF(CELL(\"contents\",LCC!K26)>0,INDEX($C$42:$C$54,G$5),0)","v":0},{"$f":"IF(CELL(\"contents\",LCC!M26)>0,INDEX($C$42:$C$54,H$5),0)","v":0},{"$f":"IF(CELL(\"contents\",LCC!O26)>0,INDEX($C$42:$C$54,I$5),0)","v":0},{"$f":"IF(CELL(\"contents\",LCC!Q26)>0,INDEX($C$42:$C$54,J$5),0)","v":0},{"$f":"IF(CELL(\"contents\",LCC!S26)>0,INDEX($C$42:$C$54,K$5),0)","v":0},{"$f":"IF(CELL(\"contents\",LCC!U26)>0,INDEX($C$42:$C$54,L$5),0)","v":0},{"$f":"IF(CELL(\"contents\",LCC!W26)>0,INDEX($C$42:$C$54,M$5),0)","v":0}]
[null,null,"consumo energetico (MJ/km)",{"$f":"((D13/100)*D14)+((D15/100)*D16)","v":0},0,0,0,0,0,0,0,0,0]
[null,null,"Costo al litro del carburante di riferimento (€/l)",{"$f":"LCC!E$60","v":0},{"$f":"LCC!G$60","v":0},{"$f":"LCC!I$60","v":0},{"$f":"LCC!K$60","v":0},{"$f":"LCC!M$60","v":0},{"$f":"LCC!O$60","v":0},{"$f":"LCC!Q$60","v":0},{"$f":"LCC!S$60","v":0},{"$f":"LCC!U$60","v":0},{"$f":"LCC!W$60","v":0}]
[null,null,"contenuto energetico carburante di riferimento",{"$f":"IF(D$6=1,$C$26, IF(D$6=2,$C$27,0))","v":0},0,0,0,0,0,0,0,0,0]
[null,null,"Costo per unità di energia (€/MJ)",{"$f":"IF(CELL(\"contents\",D18)>0,D18/D19,0)","v":0},0,0,0,0,0,0,0,0,0]
[null,null,"chilometraggio di vita (km)",{"$f":"LCC!E19*LCC!E$6","v":0},{"$f":"LCC!G19*LCC!$E$6","v":0},{"$f":"LCC!I19*LCC!E$6","v":0},{"$f":"LCC!K19*LCC!E$6","v":0},{"$f":"LCC!M19*LCC!E$6","v":0},{"$f":"LCC!O19*LCC!E$6","v":0},{"$f":"LCC!Q19*LCC!E$6","v":0},{"$f":"LCC!S19*LCC!E$6","v":0},{"$f":"LCC!U19*LCC!E$6","v":0},{"$f":"LCC!W19*LCC!E$6","v":0}]
[null,null,"costo di vita del consumo energetico (€)",{"$f":"IF(CELL(\"contents\",D17)>0,D17*D20*D21,0)","v":0},0,0,0,0,0,0,0,0,0]
[]
[null,"carburante 1",null,null,null,null,"costo totale per il carburante per il periodo specificato"]
[null,"tipo carburante","contenuto energetico","unità di misura","unità di misura consumo combustibile","unità di misura costo","prodotto 1","prodotto 2","prodotto 3","prodotto 4","prodotto 5","prodotto 6","prodotto 7","prodotto 8","prodotto 9","prodotto 10"]
[null,"Diesel",36,"MJ/l","l/100km","€/l",{"$f":"'prezzi combustibile'!$H$28","v":0},{"$f":"'prezzi combustibile'!$I$28","v":0},{"$f":"'prezzi combustibile'!$J$28","v":0},{"$f":"'prezzi combustibile'!$K$28","v":0},{"$f":"'prezzi combustibile'!L$28","v":0},{"$f":"'prezzi combustibile'!M$28","v":0},{"$f":"'prezzi combustibile'!N$28","v":0},{"$f":"'prezzi combustibile'!O$28","v":0},{"$f":"'prezzi combustibile'!P$28","v":0},{"$f":"'prezzi combustibile'!Q$28","v":0}]
[null,"benzina",32,"MJ/l","l/100km","€/l",{"$f":"'prezzi combustibile'!$H$30","v":0},{"$f":"'prezzi combustibile'!$I$30","v":0},{"$f":"'prezzi combustibile'!$J$30","v":0},{"$f":"'prezzi combustibile'!$K$30","v":0},{"$f":"'prezzi combustibile'!L$30","v":0},{"$f":"'prezzi combustibile'!M$30","v":0},{"$f":"'prezzi combustibile'!N$30","v":0},{"$f":"'prezzi combustibile'!O$30","v":0},{"$f":"'prezzi combustibile'!P$30","v":0},{"$f":"'prezzi combustibile'!Q$30","v":0}]
["i","Biogas/CBG",35,"MJ/Nm3","Nm3/100km","€/Nm3"]
["i","Natural Gas/CNG (Nm3/100km)",35,"MJ/Nm3","Nm3/100km","€/Nm3",{"$f":"'prezzi combustibile'!$H$40","v":0},{"$f":"'prezzi combustibile'!$I$40","v":0},{"$f":"'prezzi combustibile'!$J$40","v":0},{"$f":"'prezzi combustibile'!$K$40","v":0},{"$f":"'prezzi combustibile'!L$40","v":0},{"$f":"'prezzi combustibile'!M$40","v":0},{"$f":"'prezzi combustibile'!N$40","v":0},{"$f":"'prezzi combustibile'!O$40","v":0},{"$f":"'prezzi combustibile'!P$40","v":0},{"$f":"'prezzi combustibile'!Q$40","v":0}]
["i","Natural Gas/CNG (kg/100km)",{"$f":"C29*0.7","v":24.5},"MJ/kg","kg/100km","€/kg",{"$f":"'prezzi combustibile'!$H$40","v":0},{"$f":"'prezzi combustibile'!$I$40","v":0},{"$f":"'prezzi combustibile'!$J$40","v":0},{"$f":"'prezzi combustibile'!$K$40","v":0},{"$f":"'prezzi combustibile'!L$40","v":0},{"$f":"'prezzi combustibile'!M$40","v":0},{"$f":"'prezzi combustibile'!N$40","v":0},{"$f":"'prezzi combustibile'!O$40","v":0},{"$f":"'prezzi combustibile'!P$40","v":0},{"$f":"'prezzi combustibile'!Q$40","v":0}]
[null,"elettricità",3.6,"MJ/kWh","kWh/100km","€/kWh",{"$f":"'prezzi combustibile'!$H$36","v":0},{"$f":"'prezzi combustibile'!$I$36","v":0},{"$f":"'prezzi combustibile'!$J$36","v":0},{"$f":"'prezzi combustibile'!$K$36","v":0},{"$f":"'prezzi combustibile'!L$36","v":0},{"$f":"'prezzi combustibile'!M$36","v":0},{"$f":"'prezzi combustibile'!N$36","v":0},{"$f":"'prezzi combustibile'!O$36","v":0},{"$f":"'prezzi combustibile'!P$36","v":0},{"$f":"'prezzi combustibile'!Q$36","v":0}]
[null,"biodiesel",33,"MJ/l","l/100km","€/l",{"$f":"'prezzi combustibile'!$H$38","v":0},{"$f":"'prezzi combustibile'!$I$38","v":0},{"$f":"'prezzi combustibile'!$J$38","v":0},{"$f":"'prezzi combustibile'!$K$38","v":0},{"$f":"'prezzi combustibile'!L$38","v":0},{"$f":"'prezzi combustibile'!M$38","v":0},{"$f":"'prezzi combustibile'!N$38","v":0},{"$f":"'prezzi combustibile'!O$38","v":0},{"$f":"'prezzi combustibile'!P$38","v":0},{"$f":"'prezzi combustibile'!Q$38","v":0}]
[null,"LPG",24,"MJ/l","l/100km","€/l",{"$f":"'prezzi combustibile'!$H$32","v":0},{"$f":"'prezzi combustibile'!$I$32","v":0},{"$f":"'prezzi combustibile'!$J$32","v":0},{"$f":"'prezzi combustibile'!$K$32","v":0},{"$f":"'prezzi combustibile'!L$32","v":0},{"$f":"'prezzi combustibile'!M$32","v":0},{"$f":"'prezzi combustibile'!N$32","v":0},{"$f":"'prezzi combustibile'!O$32","v":0},{"$f":"'prezzi combustibile'!P$32","v":0},{"$f":"'prezzi combustibile'!Q$32","v":0}]
[null,"etanolo",21,"MJ/l","l/100km","€/l",{"$f":"'prezzi combustibile'!$H$34","v":0},{"$f":"'prezzi combustibile'!$I$34","v":0},{"$f":"'prezzi combustibile'!$J$34","v":0},{"$f":"'prezzi combustibile'!$K$34","v":0},{"$f":"'prezzi combustibile'!L$34","v":{"$error":"#REF!"}},{"$f":"'prezzi combustibile'!M$34","v":{"$error":"#REF!"}},{"$f":"'prezzi combustibile'!N$34","v":{"$error":"#REF!"}},{"$f":"'prezzi combustibile'!O$34","v":0},{"$f":"'prezzi combustibile'!P$34","v":0},{"$f":"'prezzi combustibile'!Q$34","v":0}]
[null,"idrogeno gas",11,"MJ/Nm3","Nm3/100km","€/Nm3"]
[null,"idrogeno liquido - kg/100km",120,"MJ/kg","kg/100km","€/kg"]
[null,"idrogeno liquido - l/100km",8.6,"MJ/l","l/100km","€/l"]
[null,"Carburante emulsionato ",32,"MJ/l","l/100km","€/l"]
[]
[null,"carburante 2",null,null,null,null,"costo totale per il carburante per il periodo specificato"]
[null,"tipo carburante","contenuto energetico","unità di misura","unità di misura consumo combustibile","unità di misura costo","prodotto 1","prodotto 2","prodotto 3","prodotto 4","prodotto 5","prodotto 6","prodotto 7","prodotto 8","prodotto 9","prodotto 10"]
[null,"Diesel",36,"MJ/l","l/100km","€/l",{"$f":"'prezzi combustibile'!$H$29","v":0},{"$f":"'prezzi combustibile'!$I$29","v":0},{"$f":"'prezzi combustibile'!$J$29","v":0},{"$f":"'prezzi combustibile'!$K$29","v":0},{"$f":"'prezzi combustibile'!L$29","v":0},{"$f":"'prezzi combustibile'!M$29","v":0},{"$f":"'prezzi combustibile'!N$29","v":0},{"$f":"'prezzi combustibile'!O$29","v":0},{"$f":"'prezzi combustibile'!P$29","v":0},{"$f":"'prezzi combustibile'!Q$29","v":0}]
[null,"benzina",32,"MJ/l","l/100km","€/l",{"$f":"'prezzi combustibile'!$H$31","v":0},{"$f":"'prezzi combustibile'!$I$31","v":0},{"$f":"'prezzi combustibile'!$J$31","v":0},{"$f":"'prezzi combustibile'!$K$31","v":0},{"$f":"'prezzi combustibile'!L$31","v":0},{"$f":"'prezzi combustibile'!M$31","v":0},{"$f":"'prezzi combustibile'!N$31","v":0},{"$f":"'prezzi combustibile'!O$31","v":0},{"$f":"'prezzi combustibile'!P$31","v":0},{"$f":"'prezzi combustibile'!Q$31","v":0}]
["i","Biogas/CBG",35,"MJ/Nm3","Nm3/100km","€/Nm3"]
["i","Gas Naturale/CNG (Nm3/100km)",35,"MJ/Nm3","Nm3/100km","€/Nm3",{"$f":"'prezzi combustibile'!$H$41","v":0},{"$f":"'prezzi combustibile'!$I$41","v":0},{"$f":"'prezzi combustibile'!$J$41","v":22209},{"$f":"'prezzi combustibile'!$K$41","v":0},{"$f":"'prezzi combustibile'!L$41","v":0},{"$f":"'prezzi combustibile'!M$41","v":0},{"$f":"'prezzi combustibile'!N$41","v":0},{"$f":"'prezzi combustibile'!O$41","v":0},{"$f":"'prezzi combustibile'!P$41","v":0},{"$f":"'prezzi combustibile'!Q$41","v":0}]
["i","Gas naturale/CNG (kg/100km)",23,"MJ/kg","kg/100km","€/kg",{"$f":"'prezzi combustibile'!$H$41","v":0},{"$f":"'prezzi combustibile'!$I$41","v":0},{"$f":"'prezzi combustibile'!$J$41","v":22209},{"$f":"'prezzi combustibile'!$K$41","v":0},{"$f":"'prezzi combustibile'!L$41","v":0},{"$f":"'prezzi combustibile'!M$41","v":0},{"$f":"'prezzi combustibile'!N$41","v":0},{"$f":"'prezzi combustibile'!O$41","v":0},{"$f":"'prezzi combustibile'!P$41","v":0},{"$f":"'prezzi combustibile'!Q$41","v":0}]
[null,"elettricità",3.6,"MJ/kWh","kWh/100km","€/kWh",{"$f":"'prezzi combustibile'!$H$37","v":0},{"$f":"'prezzi combustibile'!$I$37","v":0},{"$f":"'prezzi combustibile'!$J$37","v":22209},{"$f":"'prezzi combustibile'!$K$37","v":0},{"$f":"'prezzi combustibile'!L$37","v":0},{"$f":"'prezzi combustibile'!M$37","v":0},{"$f":"'prezzi combustibile'!N$37","v":0},{"$f":"'prezzi combustibile'!O$37","v":0},{"$f":"'prezzi combustibile'!P$37","v":0},{"$f":"'prezzi combustibile'!Q$37","v":0}]
[null,"biodiesel",33,"MJ/l","l/100km","€/l",{"$f":"'prezzi combustibile'!$H$39","v":0},{"$f":"'prezzi combustibile'!$I$39","v":0},{"$f":"'prezzi combustibile'!$J$39","v":22209},{"$f":"'prezzi combustibile'!$K$39","v":0},{"$f":"'prezzi combustibile'!L$39","v":0},{"$f":"'prezzi combustibile'!M$39","v":0},{"$f":"'prezzi combustibile'!N$39","v":0},{"$f":"'prezzi combustibile'!O$39","v":0},{"$f":"'prezzi combustibile'!P$39","v":0},{"$f":"'prezzi combustibile'!Q$39","v":0}]
[null,"LPG",24,"MJ/l","l/100km","€/l",{"$f":"'prezzi combustibile'!$H$33","v":0},{"$f":"'prezzi combustibile'!$I$33","v":0},{"$f":"'prezzi combustibile'!$J$33","v":0},{"$f":"'prezzi combustibile'!$K$33","v":0},{"$f":"'prezzi combustibile'!L$33","v":0},{"$f":"'prezzi combustibile'!M$33","v":0},{"$f":"'prezzi combustibile'!N$33","v":0},{"$f":"'prezzi combustibile'!O$33","v":0},{"$f":"'prezzi combustibile'!P$33","v":0},{"$f":"'prezzi combustibile'!Q$33","v":0}]
[null,"etanolo",21,"MJ/l","l/100km","€/l",{"$f":"'prezzi combustibile'!$H$35","v":0},{"$f":"'prezzi combustibile'!$I$35","v":0},{"$f":"'prezzi combustibile'!$J$35","v":0},{"$f":"'prezzi combustibile'!$K$35","v":0},{"$f":"'prezzi combustibile'!L$35","v":{"$error":"#REF!"}},{"$f":"'prezzi combustibile'!M$35","v":{"$error":"#REF!"}},{"$f":"'prezzi combustibile'!N$35","v":{"$error":"#REF!"}},{"$f":"'prezzi combustibile'!O$35","v":0},{"$f":"'prezzi combustibile'!P$35","v":0},{"$f":"'prezzi combustibile'!Q$35","v":0}]
[null,"idrogeno gas",11,"MJ/Nm3","Nm3/100km","€/Nm3"]
[null,"idrogeno liquido - kg/100km",120,"MJ/kg","kg/100km","€/kg"]
[null,"idrogeno liquido - l/100km",8.6,"MJ/l","l/100km","€/l"]
[null,"Carburante emulsionato ",32,"MJ/l","l/100km","€/l"]
[]
[null,"Elenchi a tendina"]
[null,"tipo di contratto","carburante di riferimento","aumento prezzo carburante","si_no"]
[null,"acquisto","Diesel","scegli uno dei valori","si","si "]
[null,"leasing","benzina","Usa i valori OECD-FAO di default","no","no"]

{"sheet":"esempio","index":5,"n_rows":108,"n_cols":14,"rows_kept":108,"cut":false,"hidden":true,"merged":[[68,2,68,3],[61,15,61,16],[62,15,62,16],[63,15,63,16],[66,15,66,16],[67,2,67,3],[67,15,67,16]]}
[]
[null,null,null,"VEICOLI - CALCOLATORE LCC"]
[null,null,null,"completa riempiendo solo le celle bianche "]
[]
[null,"CONDIZIONI GENERALI"]
[null,null,"lunghezza contratto","anno",10,null,{"$f":"E6","v":10},null,{"$f":"E6","v":10},null,{"$f":"E6","v":10},null,null,{"$f":"F6","v":0}]
[null,"i","sconto","%",2,null,{"$f":"E7","v":2},null,{"$f":"E7","v":2},null,{"$f":"E7","v":2},null,null,{"$f":"F7","v":0}]
[null,"i","numero offerte",null,2]
[]
[null,"COSTI DI ACQUISIZIONE"]
[null,null,"Name del modello di veicolo",null,"Mercedes Citaro 10.5m",null,"Volvo Hybrid 10.5m",null,"Product 3",null,"Product 4",null,"Product 5"]
[]
[null,"i","numero di veicoli",null,10,null,10]
[null,"i","prezzo di acquisto","€/unità",217800,"€/unità",310000,"€/unità",null,"€/unità",null,"€/unità"]
[null,null,"(or) prezzo leasing","€/unità/anno",null,"€/unità/anno",null,"€/unità/anno",null,"€/unità/anno",null,"€/unità/anno"]
[null,null,"COSTI DI ACQUISIZIONE / unità",null,{"$f":"IF(CELL(\"type\",E13)=\"v\",-PV($E$7*0.01,$E$6,E15)+E14,0)","v":217800},null,{"$f":"IF(CELL(\"type\",G13)=\"v\",-PV($E$7*0.01,$E$6,G15)+G14,0)","v":310000},null,{"$f":"IF(CELL(\"type\",I13)=\"v\",-PV($E$7*0.01,$E$6,I15)+I14,0)","v":0},null,{"$f":"IF(CELL(\"type\",K13)=\"v\",-PV($E$7*0.01,$E$6,K15)+K14,0)","v":0},null,{"$f":"IF(CELL(\"type\",M13)=\"v\",-PV($E$7*0.01,$E$6,M15)+M14,0)","v":0}]
[]
[null,"COSTI OPERATIVI PER VEICOLO"]
[null,"i","uso annuale veicolo","km",80000,"km",80000,"km",20000,"km",null,"km"]
[null,"i","tipo di carburante",null,"Diesel",null,"Diesel",null,"Biodiesel"]
[null,"i","consumo di carburante per veicolo ","l/100km",41.9,{"$f":"INDEX('calcolo esempio'!$E$26:$E$38,'calcolo esempio'!E$4)","v":"l/100km"},32.6,{"$f":"INDEX('calcolo esempio'!$E$26:$E$38,'calcolo esempio'!F$4)","v":"l/100km"},60,{"$f":"INDEX('calcolo esempio'!$E$26:$E$38,'calcolo esempio'!G$4)","v":{"$error":"#N/A"}},null,{"$f":"INDEX('calcolo esempio'!$E$26:$E$38,'calcolo esempio'!H$4)","v":{"$error":"#N/A"}}]
[null,null,"prezzo carburante","€/l",1.22,{"$f":"INDEX('calcolo esempio'!$F$26:$F$38,'calcolo esempio'!E4)","v":"€/l"},1.22,{"$f":"INDEX('calcolo esempio'!$F$26:$F$38,'calcolo esempio'!F4)","v":"€/l"},3,{"$f":"INDEX('calcolo esempio'!$F$26:$F$38,'calcolo esempio'!G4)","v":{"$error":"#N/A"}},null,{"$f":"INDEX('calcolo esempio'!$F$26:$F$38,'calcolo esempio'!H4)","v":{"$error":"#N/A"}}]
[null,"i","secondo tipo di carburante?",null,"No",null,"No",null,"No"]
[null,null,"tipo di carburante",null,null,null,"benzina"]
[null,"i","consumo di carburante per veicolo ",{"$f":"INDEX(calcoli!$E$26:$E$38,calcoli!D$5)","v":{"$error":"#VALUE!"}},null,{"$f":"INDEX('calcolo esempio'!$E$26:$E$38,'calcolo esempio'!E$5)","v":"l/100km"},250,{"$f":"INDEX('calcolo esempio'!$E$26:$E$38,'calcolo esempio'!F$5)","v":{"$error":"#N/A"}},null,{"$f":"INDEX('calcolo esempio'!$E$26:$E$38,'calcolo esempio'!G$5)","v":{"$error":"#N/A"}},null,{"$f":"INDEX('calcolo esempio'!$E$26:$E$38,'calcolo esempio'!H$5)","v":{"$error":"#N/A"}}]
[null,null,"prezzo carburante",{"$f":"INDEX(calcoli!$F$26:$F$38,calcoli!D5)","v":"€/l"},null,{"$f":"INDEX('calcolo esempio'!$F$26:$F$38,'calcolo esempio'!E5)","v":"€/l"},1,{"$f":"INDEX('calcolo esempio'!$F$26:$F$38,'calcolo esempio'!F5)","v":{"$error":"#N/A"}},null,{"$f":"INDEX('calcolo esempio'!$F$26:$F$38,'calcolo esempio'!G5)","v":{"$error":"#N/A"}},null,{"$f":"INDEX('calcolo esempio'!$F$26:$F$38,'calcolo esempio'!H5)","v":{"$error":"#N/A"}}]
[null,null,"Replacement battery price","€/unità",null,"€/unità",25,"€/unità",null,"€/unità",null,"€/unità",null,"€/unità"]
[null,null,"Expected lifetime of battery","annos",null,"annos",3,"annos",null,"annos",null,"annos",null,"annos"]
[null,null,"(or) Battery lease price","€/unità/anno",null,"€/unità/anno",null,"€/unità/anno",null,"€/unità/anno",null,"€/unità/anno",null,"€/unità/anno"]
[null,null,"COSTI OPERATIVI / unità ",null,{"$f":"IF(CELL(\"type\",E19)=\"v\",IF($C$81=\"Use default OECD-FAO values\",-PV($E$7*0.01,$E$6,'calcolo esempio'!D9+'calcolo esempio'!D10+esempio!E29),-PV($E$7*0.01,$E$6,$E$25*(E19/100)*'calcolo esempio'!D11)+(E21*(E19/100)*'calcolo esempio'!D12)+'calcolo esempio'!D10+esempio!E29),0)","v":15},null,{"$f":"IF(CELL(\"type\",G19)=\"v\",IF($C$81=\"Use default OECD-FAO values\",-PV($E$7*0.01,$E$6,'calcolo esempio'!E9+'calcolo esempio'!E10+esempio!G29),-PV($E$7*0.01,$E$6,$E$25*(G19/100)*'calcolo esempio'!E11)+(G21*(G19/100)*'calcolo esempio'!E12)+'calcolo esempio'!E10+esempio!G29),0)","v":26080},null,{"$f":"IF(CELL(\"type\",I19)=\"v\",IF($C$81=\"Use default OECD-FAO values\",-PV($E$7*0.01,$E$6,'calcolo esempio'!F9+'calcolo esempio'!F10+esempio!I29),-PV($E$7*0.01,$E$6,$E$25*(I19/100)*'calcolo esempio'!F11)+(I21*(I19/100)*'calcolo esempio'!F12)+'calcolo esempio'!F10+esempio!I29),0)","v":0},null,{"$f":"IF(CELL(\"type\",K19)=\"v\",IF($C$81=\"Use default OECD-FAO values\",-PV($E$7*0.01,$E$6,'calcolo esempio'!G9+'calcolo esempio'!G10+esempio!K29),-PV($E$7*0.01,$E$6,$E$25*(K19/100)*'calcolo esempio'!G11)+(K21*(K19/100)*'calcolo esempio'!G12)+'calcolo esempio'!G10+esempio!K29),0)","v":0},null,{"$f":"IF(CELL(\"type\",M19)=\"v\",IF($C$81=\"Use default OECD-FAO values\",-PV($E$7*0.01,$E$6,'calcolo esempio'!H9+'calcolo esempio'!H10+esempio!M29),-PV($E$7*0.01,$E$6,$E$25*(M19/100)*'calcolo esempio'!H11)+(M21*(M19/100)*'calcolo esempio'!H12)+'calcolo esempio'!H10+esempio!M29),0)","v":0}]
[]
[null,"COSTI DI MANUTENZIONE PER VEICOLO "]
[null,"i","costi stimati annuali manutenzione","€/unità/anno",null,"€/unità/anno",null,"€/unità/anno",null,"€/unità/anno",null,"€/unità/anno"]
[null,"i","(o) costo annuale del servizio","€/unità/anno",null,"€/unità/anno",null,"€/unità/anno",300,"€/unità/anno",null,"€/unità/anno"]
[null,null,"COSTI DI MANUTENZIONE / unità",null,{"$f":"IF(CELL(\"type\",E33)=\"v\",-PV($E$7*0.01,$E$6,(E34+E33)),IF(CELL(\"type\",E34)=\"v\",-PV($E$7*0.01,$E$6,(E34+E33)),0))","v":0},null,{"$f":"IF(CELL(\"type\",G33)=\"v\",-PV($E$7*0.01,$E$6,(G34+G33)),IF(CELL(\"type\",G34)=\"v\",-PV($E$7*0.01,$E$6,(G34+G33)),0))","v":0},null,{"$f":"IF(CELL(\"type\",I33)=\"v\",-PV($E$7*0.01,$E$6,(I34+I33)),IF(CELL(\"type\",I34)=\"v\",-PV($E$7*0.01,$E$6,(I34+I33)),0))","v":2694.7755018726702},null,{"$f":"IF(CELL(\"type\",K33)=\"v\",-PV($E$7*0.01,$E$6,(K34+K33)),IF(CELL(\"type\",K34)=\"v\",-PV($E$7*0.01,$E$6,(K34+K33)),0))","v":0},null,{"$f":"IF(CELL(\"type\",M33)=\"v\",-PV($E$7*0.01,$E$6,(M34+M33)),IF(CELL(\"type\",M34)=\"v\",-PV($E$7*0.01,$E$6,(M34+M33)),0))","v":0}]
[]
[null,"EMISSIONI (OLC) PER VEICOLO - SEZIONE OPZIONALE"]
[null,"i","tasse","€/unità/anno",null,"€/unità/anno",null,"€/unità/anno",null,"€/unità/anno",null,"€/unità/anno"]
[null,null,"assicurazione","€/unità/anno",null,"€/unità/anno",null,"€/unità/anno",null,"€/unità/anno",null,"€/unità/anno"]
[null,"i","infrastrutture - investimenti","€",null,"€",null,"€",null,"€",null,"€"]
[null,null,"(o) infrastrutture costi annuali","€/anno",null,"€/anno",null,"€/anno",null,"€/anno",null,"€/anno"]
[null,"i","Altri costi e sussidi"]
[null,null,"(Annual cost 1)","€/anno",null,"€/anno",null,"€/anno",null,"€/anno",null,"€/anno",null,"€/anno"]
[null,null,"(Annual cost 2)","€/anno",null,"€/anno",null,"€/anno",null,"€/anno",null,"€/anno",null,"€/anno"]
[null,null,"(One off initial cost 1)","€",null,"€",null,"€",null,"€",null,"€",null,"€"]
[null,null,"(One off initial cost 2)","€",null,"€",null,"€",null,"€",null,"€",null,"€"]
[null,null,"(Annual subsidy)","€",null,null,null,null,null,null,null,null,null,"€"]
[null,null,"(One off initial subsidy)","€",null,null,null,null,null,null,null,null,null,"€"]
[null,null,"TOTALE ALTRI COSTI E SUSSIDI/ unità",null,{"$f":"-PV(E7*0.01,E6,(E38+E39+E41+E43+E44-E47))+E40+E45+E46-E48","v":0},null,{"$f":"-PV(G7*0.01,G6,(G38+G39+G41+G43+G44-G47))+G40+G45+G46-G48","v":0},null,{"$f":"-PV(I7*0.01,I6,(I38+I39+I41+I43+I44-I47))+I40+I45+I46-I48","v":0},null,{"$f":"-PV(K7*0.01,K6,(K38+K39+K41+K43+K44-K47))+K40+K45+K46-K48","v":0},null,{"$f":"-PV(M7*0.01,M6,(M38+M39+M41+M43+M44-M47))+M40+M45+M46-M48","v":0}]
[]
[null,"EMISSIONI (OLC) PER VEICOLO - SEZIONE OPZIONALE"]
[null,null,"vuoi applicare la metodologia OLC delle direttiva?",null,"sì "]
[null,"i","Emissioni CO2 ","g/km",1.1100000000000001,"g/km",864,"g/km",null,"g/km",null,"g/km"]
[null,null,"costo di vita delle emissioni CO2  / unità",null,{"$f":"$D$77*E53*E19*$E$6","v":26.64},null,{"$f":"$D$77*G53*G19*$E$6","v":20736.000000000004},null,{"$f":"$D$77*I53*I19*$E$6","v":0},null,{"$f":"$D$77*K53*K19*$E$6","v":0},null,{"$f":"$D$77*M53*M19*$E$6","v":0}]
[null,"i","NOx (ossidi di azoto)","g/km",0.24,"g/km",0.24,"g/km",null,"g/km",null,"g/km"]
[null,"i","PM (Particolato)","g/km",2.8999999999999998E-3,"g/km",2.8999999999999998E-3,"g/km",null,"g/km",null,"g/km"]
[null,"i","NMHC (idrocarburi non metanici)","g/km",7.0000000000000001E-3,"g/km",7.0000000000000001E-3,"g/km",null,"g/km",null,"g/km"]
[null,null,"costo di vita degli inquinanti / unità",null,{"$f":"((E55*$D$74)+(E56*$D$75)+(E57*$D$76))*E19*E6","v":1052.2400000000002},null,{"$f":"((G55*$D$74)+(G56*$D$75)+(G57*$D$76))*G19*G6","v":1052.2400000000002},null,{"$f":"((I55*$D$74)+(I56*$D$75)+(I57*$D$76))*I19*I6","v":0},null,{"$f":"((K55*$D$74)+(K56*$D$75)+(K57*$D$76))*K19*K6","v":0},null,{"$f":"((M55*$D$74)+(M56*$D$75)+(M57*$D$76))*M19*M6","v":0}]
[null,"i","carburante di riferimento (il più economico senza tasse)",null,"Diesel",null,"Diesel"]
[null,"i","Costo di riferimento del carburante (prima delle tasse)","€/l",1.01,"€/l",1.01,"€/l",null,"€/l",null,"€/l"]
[null,null,"costo di vita del consumo di energia  / unità",null,{"$f":"'calcolo esempio'!D22","v":338552},null,{"$f":"IF(CELL(\"type\",G60)=\"v\",'calcolo esempio'!E22,0)","v":2058963.5555555557},null,{"$f":"IF(CELL(\"type\",I60)=\"v\",'calcolo esempio'!G22,0)","v":0},null,{"$f":"IF(CELL(\"type\",K60)=\"v\",'calcolo esempio'!I22,0)","v":0},null,{"$f":"IF(CELL(\"type\",M60)=\"v\",'calcolo esempio'!K22,0)","v":0}]
[null,null,"COSTO OPERATIVO DI VITA  (OLC) / unità",null,{"$f":"SUM(E54,E58,E61)","v":339630.88},null,{"$f":"SUM(G54,G58,G61)","v":2080751.7955555557},null,{"$f":"SUM(I54,I58,I61)","v":0},null,{"$f":"SUM(K54,K58,K61)","v":0},null,{"$f":"SUM(M54,M58,M61)","v":0}]
[]
[null,"END OF LIFE"]
[null,"i","valore residuale (fine del contratto)","€/unità",null,null,0]
[null,null,null,null,{"$f":"SUM(E65)","v":0},null,{"$f":"SUM(G65)","v":0},null,{"$f":"SUM(I65)","v":0},null,null,null,{"$f":"SUM(M65)","v":0}]
[]
[null,null,"TOTAL LCC PER unità",null,{"$f":"E16+E30+E35+E49+E62-E66","v":557445.88},null,{"$f":"G16+G30+G35+G49+G62-G66","v":2416831.7955555557},null,{"$f":"I16+I30+I35+I49+I62-I66","v":2694.7755018726702},null,{"$f":"K16+K30+K35+K49+K62-K66","v":0},null,{"$f":"M16+M30+M35+M49+M62-M66","v":0}]
[null,null,"TOTAL LCC",null,{"$f":"E68*E13","v":5574458.7999999998},null,{"$f":"G68*G13","v":24168317.955555558},null,{"$f":"I68*I13","v":0},null,{"$f":"K68*K13","v":0},null,{"$f":"M68*M13","v":0}]
[]
[]
[null,"COSTO DELLE EMISSIONI",null,null,null,">","CLICCA QUI PER I DIAGRAMMI"]
[null,null,"emissioni","Costo per unità €/g"]
[null,null,"NOx  (range consentito 0,0044-0,0088)",4.4000000000000003E-3]
[null,null,"PM  (range consentito 0,087-0,174)",8.6999999999999994E-2]
[null,null,"NMHC  (range consentito 0,001-0,002)",1E-3]
[null,null,"CO2  (range consentito 0,00003 - 0,00008)",3.0000000000000001E-5]
[]
[null,"AUMENTO PREZZO CARBURANTE"]
[null,null,"seleziona una delle opzioni sotto"]
[null,"i","usa OECD-FAO valori di default"]
[]
[null,null,"Annual fuel price increase %"]
[null,null,"Diesel (€/l)"]
[null,null,"Petrol (€/l)"]
[null,null,"Biogas/CBG"]
[null,null,"Natural Gas/CNG (€/Nm3)"]
[null,null,"Electricity (€/kWh)"]
[null,null,"Biodiesel (€/l)"]
[null,null,"LPG (€/l)"]
[null,null,"Ethanol (€/l)"]
[null,null,"Hydrogen gas (€/Nm3)"]
[null,null,"Hydrogen liquid - kg/100km (€/kg)"]
[null,null,"Hydrogen liquid - l/100km  (€/l)"]
[null,null,"Emulsion Fuel (€/l)"]
[null,null,null,"inserisci le tue percentuali di incremento annuali nel box sotto"]
[null,null,"Diesel",{"$f":"INDEX('prezzi combustibile'!$D$6:$N$6,esempio!$E$6)/esempio!$E$6","v":5.0644860388471572E-3}]
[null,null,"benzina",{"$f":"INDEX('prezzi combustibile'!$D$9:$N$9,esempio!$E$6)/esempio!$E$6","v":-4.5540741712443832E-3}]
[null,null,"Biogas/CBG"]
[null,null,"Natural Gas/CNG (Nm3/100km)",{"$f":"INDEX('prezzi combustibile'!$D$24:$N$24,esempio!$E$6)/esempio!$E$6","v":1.1084629019867237E-2}]
[null,null,"elettricità",{"$f":"INDEX('prezzi combustibile'!$D$18:$N$18,esempio!$E$6)/esempio!$E$6","v":-1.7245445010784567E-3}]
[null,null,"biodiesel",{"$f":"INDEX('prezzi combustibile'!$D$21:$N$21,esempio!$E$6)/esempio!$E$6","v":1.1679553794919037E-2}]
[null,null,"LPG",{"$f":"INDEX('prezzi combustibile'!$D$12:$N$12,esempio!$E$6)/esempio!$E$6","v":6.248446321897228E-3}]
[null,null,"etanolo",{"$f":"INDEX('prezzi combustibile'!$D$15:$N$15,esempio!$E$6)/esempio!$E$6","v":5.0482392644199733E-3}]
[null,null,"idrogeno gas"]
[null,null,"idrogeno liquido - kg/100km"]
[null,null,"idrogeno liquido - l/100km"]
[null,null," carburante emulsionato"]

{"sheet":"calcolo esempio","index":6,"n_rows":59,"n_cols":42,"rows_kept":59,"cut":false,"hidden":true,"merged":[]}
["FOR CALCULATIONS ONLY - DO NOT AMEND!",null,null,null,null,null,null,null,null,null,null,null,null,null,null,"SINGLE FUEL TIME SERIES",null,null,null,null,null,null,null,null,null,null,null,null,"Fuel 1\nTime Series","SECOND FUEL TIME SERIES"]
[]
[null,null,null,"Product 1","Product 2","Product 3","Product 4","Product 5",null,null,null,null,null,null,null,"DIESEL",2014,2015,2016,2017,2018,2019,2020,2021,2022,2023,2024,"Total fuel price for period",null,"DIESEL",2014,2015,2016,2017,2018,2019,2020,2021,2022,2023,2024,"Total fuel price for period"]
[null,null,"tipo di carburante",{"$f":"MATCH(esempio!E20,$B$26:$B$38,0)","v":1},{"$f":"MATCH(esempio!G20,$B$26:$B$38,0)","v":1},{"$f":"MATCH(esempio!I20,$B$26:$B$38,0)","v":7},{"$f":"MATCH(esempio!K20,$B$26:$B$38,0)","v":{"$error":"#N/A"}},{"$f":"MATCH(esempio!M20,$B$26:$B$38,0)","v":{"$error":"#N/A"}},null,null,null,null,null,null,null,"Product 1",{"$f":"((esempio!$E$19*(esempio!$E$21/100))*esempio!$E$22)","v":40894.400000000001},{"$f":"((esempio!$E$19*(esempio!$E$21/100))*(esempio!$E$22*(1+'prezzi combustibile'!$E$6)))","v":39348.945563063855},{"$f":"((esempio!$E$19*(esempio!$E$21/100))*(esempio!$E$22*(1+'prezzi combustibile'!$F$6)))","v":38784.603092298101},{"$f":"((esempio!$E$19*(esempio!$E$21/100))*(esempio!$E$22*(1+'prezzi combustibile'!$G$6)))","v":38807.032151845939},{"$f":"((esempio!$E$19*(esempio!$E$21/100))*(esempio!$E$22*(1+'prezzi combustibile'!$H$6)))","v":39236.517252013509},{"$f":"((esempio!$E$19*(esempio!$E$21/100))*(esempio!$E$22*(1+'prezzi combustibile'!$I$6)))","v":40124.655521807399},{"$f":"((esempio!$E$19*(esempio!$E$21/100))*(esempio!$E$22*(1+'prezzi combustibile'!$J$6)))","v":40818.484510988194},{"$f":"((esempio!$E$19*(esempio!$E$21/100))*(esempio!$E$22*(1+'prezzi combustibile'!$K$6)))","v":41585.02445823585},{"$f":"((esempio!$E$19*(esempio!$E$21/100))*(esempio!$E$22*(1+'prezzi combustibile'!$L$6)))","v":42405.645090833677},{"$f":"((esempio!$E$19*(esempio!$E$21/100))*(esempio!$E$22*(1+'prezzi combustibile'!$M$6)))","v":42965.491178670309},{"$f":"((esempio!$E$19*(esempio!$E$21/100))*(esempio!$E$22*(1+'prezzi combustibile'!$N$6)))","v":43494.950470232572},{"$f":"SUM(Q4:INDEX(Q4:AA4,esempio!$E$6))","v":404970.79881975683},null,"Product 1",{"$f":"((esempio!$E$19*(esempio!$E$25/100))*esempio!$E$26)","v":0},{"$f":"((esempio!$E$19*(esempio!$E$25/100))*(esempio!$E$26*(1+'prezzi combustibile'!$E$6)))","v":0},{"$f":"((esempio!$E$19*(esempio!$E$25/100))*(esempio!$E$26*(1+'prezzi combustibile'!$F$6)))","v":0},{"$f":"((esempio!$E$19*(esempio!$E$25/100))*(esempio!$E$26*(1+'prezzi combustibile'!$G$6)))","v":0},{"$f":"((esempio!$E$19*(esempio!$E$25/100))*(esempio!$E$26*(1+'prezzi combustibile'!$H$6)))","v":0},{"$f":"((esempio!$E$19*(esempio!$E$25/100))*(esempio!$E$26*(1+'prezzi combustibile'!$I$6)))","v":0},{"$f":"((esempio!$E$19*(esempio!$E$25/100))*(esempio!$E$26*(1+'prezzi combustibile'!$J$6)))","v":0},{"$f":"((esempio!$E$19*(esempio!$E$25/100))*(esempio!$E$26*(1+$K$6)))","v":0},{"$f":"((esempio!$E$19*(esempio!$E$25/100))*(esempio!$E$26*(1+$L$6)))","v":0},{"$f":"((esempio!$E$19*(esempio!$E$25/100))*(esempio!$E$26*(1+$M$6)))","v":0},{"$f":"((esempio!$E$19*(esempio!$E$25/100))*(esempio!$E$26*(1+$N$6)))","v":0},{"$f":"SUM(AE4:INDEX(AE4:AO4,esempio!$E$6))","v":0}]
[null,null,"tipo di carburante 2",{"$f":"MATCH(esempio!E24,$B$26:$B$38,0)","v":{"$error":"#N/A"}},{"$f":"MATCH(esempio!G24,$B$26:$B$38,0)","v":2},{"$f":"MATCH(esempio!I24,$B$26:$B$38,0)","v":{"$error":"#N/A"}},{"$f":"MATCH(esempio!K24,$B$26:$B$38,0)","v":{"$error":"#N/A"}},{"$f":"MATCH(esempio!M24,$B$26:$B$38,0)","v":{"$error":"#N/A"}},null,null,null,null,null,null,null,"Product 2",{"$f":"((esempio!$G$19*(esempio!$G$21/100))*esempio!$G$22)","v":31817.599999999999},{"$f":"((esempio!$G$19*(esempio!$G$21/100))*(esempio!$G$22*(1+'prezzi combustibile'!$E$6)))","v":30615.170056226292},{"$f":"((esempio!$G$19*(esempio!$G$21/100))*(esempio!$G$22*(1+'prezzi combustibile'!$F$6)))","v":30176.087370141242},{"$f":"((esempio!$G$19*(esempio!$G$21/100))*(esempio!$G$22*(1+'prezzi combustibile'!$G$6)))","v":30193.538142009013},{"$f":"((esempio!$G$19*(esempio!$G$21/100))*(esempio!$G$22*(1+'prezzi combustibile'!$H$6)))","v":30527.696000373278},{"$f":"((esempio!$G$19*(esempio!$G$21/100))*(esempio!$G$22*(1+'prezzi combustibile'!$I$6)))","v":31218.705728184275},{"$f":"((esempio!$G$19*(esempio!$G$21/100))*(esempio!$G$22*(1+'prezzi combustibile'!$J$6)))","v":31758.534488262892},{"$f":"((esempio!$G$19*(esempio!$G$21/100))*(esempio!$G$22*(1+'prezzi combustibile'!$K$6)))","v":32354.935497338633},{"$f":"((esempio!$G$19*(esempio!$G$21/100))*(esempio!$G$22*(1+'prezzi combustibile'!$L$6)))","v":32993.413602892077},{"$f":"((esempio!$G$19*(esempio!$G$21/100))*(esempio!$G$22*(1+'prezzi combustibile'!$M$6)))","v":33428.997909896229},{"$f":"((esempio!$G$19*(esempio!$G$21/100))*(esempio!$G$22*(1+'prezzi combustibile'!$N$6)))","v":33840.939983999568},{"$f":"SUM(Q5:INDEX(Q5:AA5,esempio!$G$6))","v":315084.67879532394},null,"Product 2",{"$f":"((esempio!$G$19*(esempio!$G$25/100))*esempio!$G$26)","v":200000},{"$f":"((esempio!$G$19*(esempio!$G$25/100))*(esempio!$G$26*(1+'prezzi combustibile'!$E$6)))","v":192441.73071649836},{"$f":"((esempio!$G$19*(esempio!$G$25/100))*(esempio!$G$26*(1+'prezzi combustibile'!$F$6)))","v":189681.73193541463},{"$f":"((esempio!$G$19*(esempio!$G$25/100))*(esempio!$G$26*(1+'prezzi combustibile'!$G$6)))","v":189791.42450724763},{"$f":"((esempio!$G$19*(esempio!$G$25/100))*(esempio!$G$26*(1+'prezzi combustibile'!$H$6)))","v":191891.88373964897},{"$f":"((esempio!$G$19*(esempio!$G$25/100))*(esempio!$G$26*(1+'prezzi combustibile'!$I$6)))","v":196235.45288258244},{"$f":"((esempio!$G$19*(esempio!$G$25/100))*(esempio!$G$26*(1+'prezzi combustibile'!$J$6)))","v":199628.72428003929},{"$f":"((esempio!$G$19*(esempio!$G$25/100))*(esempio!$G$26*(1+$K$6)))","v":200000},{"$f":"((esempio!$G$19*(esempio!$G$25/100))*(esempio!$G$26*(1+$L$6)))","v":200000},{"$f":"((esempio!$G$19*(esempio!$G$25/100))*(esempio!$G$26*(1+$M$6)))","v":200000},{"$f":"((esempio!$G$19*(esempio!$G$25/100))*(esempio!$G$26*(1+$N$6)))","v":200000},{"$f":"SUM(AE5:INDEX(AE5:AO5,esempio!$E$6))","v":1959670.9480614313}]
[null,null,"carburante di riferimento (1 = diesel, 2 = benzina)",{"$f":"IF(esempio!E59>0,IF(esempio!E59=\"Diesel\",1,2),0)","v":1},{"$f":"IF(esempio!G59>0,IF(esempio!G59=\"Diesel\",1,2),0)","v":1},{"$f":"IF(esempio!I59>0,IF(esempio!I59=\"Diesel\",1,2),0)","v":0},{"$f":"IF(esempio!K59>0,IF(esempio!K59=\"Diesel\",1,2),0)","v":0},{"$f":"IF(esempio!M59>0,IF(esempio!M59=\"Diesel\",1,2),0)","v":0},null,null,null,null,null,null,null,"Product 3",{"$f":"((esempio!$I$19*(esempio!$I$21/100))*esempio!$I$22)","v":36000},{"$f":"((esempio!$I$19*(esempio!$I$21/100))*(esempio!$I$22*(1+'prezzi combustibile'!$E$6)))","v":34639.511528969706},{"$f":"((esempio!$I$19*(esempio!$I$21/100))*(esempio!$I$22*(1+'prezzi combustibile'!$F$6)))","v":34142.711748374633},{"$f":"((esempio!$I$19*(esempio!$I$21/100))*(esempio!$I$22*(1+'prezzi combustibile'!$G$6)))","v":34162.456411304578},{"$f":"((esempio!$I$19*(esempio!$I$21/100))*(esempio!$I$22*(1+'prezzi combustibile'!$H$6)))","v":34540.539073136817},{"$f":"((esempio!$I$19*(esempio!$I$21/100))*(esempio!$I$22*(1+'prezzi combustibile'!$I$6)))","v":35322.381518864837},{"$f":"((esempio!$I$19*(esempio!$I$21/100))*(esempio!$I$22*(1+'prezzi combustibile'!$J$6)))","v":35933.170370407068},{"$f":"((esempio!$I$19*(esempio!$I$21/100))*(esempio!$I$22*(1+'prezzi combustibile'!$K$6)))","v":36607.96785125813},{"$f":"((esempio!$I$19*(esempio!$I$21/100))*(esempio!$I$22*(1+'prezzi combustibile'!$L$6)))","v":37330.373431814936},{"$f":"((esempio!$I$19*(esempio!$I$21/100))*(esempio!$I$22*(1+'prezzi combustibile'!$M$6)))","v":37823.21497398497},{"$f":"((esempio!$I$19*(esempio!$I$21/100))*(esempio!$I$22*(1+'prezzi combustibile'!$N$6)))","v":38289.306529216054},{"$f":"SUM(Q6:INDEX(Q6:AA6,esempio!$I$6))","v":356502.32690811565},null,"Product 3",{"$f":"((esempio!$I$19*(esempio!$I$25/100))*esempio!$I$26)","v":0},{"$f":"((esempio!$I$19*(esempio!$I$25/100))*(esempio!$I$26*(1+'prezzi combustibile'!$E$6)))","v":0},{"$f":"((esempio!$I$19*(esempio!$I$25/100))*(esempio!$I$26*(1+'prezzi combustibile'!$F$6)))","v":0},{"$f":"((esempio!$I$19*(esempio!$I$25/100))*(esempio!$I$26*(1+'prezzi combustibile'!$G$6)))","v":0},{"$f":"((esempio!$I$19*(esempio!$I$25/100))*(esempio!$I$26*(1+'prezzi combustibile'!$H$6)))","v":0},{"$f":"((esempio!$I$19*(esempio!$I$25/100))*(esempio!$I$26*(1+'prezzi combustibile'!$I$6)))","v":0},{"$f":"((esempio!$I$19*(esempio!$I$25/100))*(esempio!$I$26*(1+'prezzi combustibile'!$J$6)))","v":0},{"$f":"((esempio!$I$19*(esempio!$I$25/100))*(esempio!$I$26*(1+$K$6)))","v":0},{"$f":"((esempio!$I$19*(esempio!$I$25/100))*(esempio!$I$26*(1+$L$6)))","v":0},{"$f":"((esempio!$I$19*(esempio!$I$25/100))*(esempio!$I$26*(1+$M$6)))","v":0},{"$f":"((esempio!$I$19*(esempio!$I$25/100))*(esempio!$I$26*(1+$N$6)))","v":0},{"$f":"SUM(AE6:INDEX(AE6:AO6,esempio!$E$6))","v":0}]
[null,null,"carburante 1",{"$f":"INDEX($G$26:$G$38,D4)/esempio!$E$6","v":40497.079881975682},{"$f":"INDEX($H$26:$H$38,E4)/esempio!$E$6","v":31508.467879532393},{"$f":"INDEX($I$26:$I$38,F4)/esempio!$E$6","v":35650.232690811565},{"$f":"INDEX($J$26:$J$38,G4)/esempio!$E$6","v":{"$error":"#N/A"}},{"$f":"INDEX($K$26:$K$38,H4)/esempio!$E$6","v":{"$error":"#N/A"}},null,null,null,null,null,null,null,"Product 4",{"$f":"((esempio!$K$19*(esempio!$K$21/100))*esempio!$K$22)","v":0},{"$f":"((esempio!$K$19*(esempio!$K$21/100))*(esempio!$K$22*(1+'prezzi combustibile'!$E$6)))","v":0},{"$f":"((esempio!$K$19*(esempio!$K$21/100))*(esempio!$K$22*(1+'prezzi combustibile'!$F$6)))","v":0},{"$f":"((esempio!$K$19*(esempio!$K$21/100))*(esempio!$K$22*(1+'prezzi combustibile'!$G$6)))","v":0},{"$f":"((esempio!$K$19*(esempio!$K$21/100))*(esempio!$K$22*(1+'prezzi combustibile'!$H$6)))","v":0},{"$f":"((esempio!$K$19*(esempio!$K$21/100))*(esempio!$K$22*(1+'prezzi combustibile'!$I$6)))","v":0},{"$f":"((esempio!$K$19*(esempio!$K$21/100))*(esempio!$K$22*(1+'prezzi combustibile'!$J$6)))","v":0},{"$f":"((esempio!$K$19*(esempio!$K$21/100))*(esempio!$K$22*(1+'prezzi combustibile'!$K$6)))","v":0},{"$f":"((esempio!$K$19*(esempio!$K$21/100))*(esempio!$K$22*(1+'prezzi combustibile'!$L$6)))","v":0},{"$f":"((esempio!$K$19*(esempio!$K$21/100))*(esempio!$K$22*(1+'prezzi combustibile'!$M$6)))","v":0},{"$f":"((esempio!$K$19*(esempio!$K$21/100))*(esempio!$K$22*(1+'prezzi combustibile'!$N$6)))","v":0},{"$f":"SUM(Q7:INDEX(Q7:AA7,esempio!$K$6))","v":0},null,"Product 4",{"$f":"((esempio!$K$19*(esempio!$K$25/100))*esempio!$K$26)","v":0},{"$f":"((esempio!$K$19*(esempio!$K$25/100))*(esempio!$K$26*(1+'prezzi combustibile'!$E$6)))","v":0},{"$f":"((esempio!$K$19*(esempio!$K$25/100))*(esempio!$K$26*(1+'prezzi combustibile'!$F$6)))","v":0},{"$f":"((esempio!$K$19*(esempio!$K$25/100))*(esempio!$K$26*(1+'prezzi combustibile'!$G$6)))","v":0},{"$f":"((esempio!$K$19*(esempio!$K$25/100))*(esempio!$K$26*(1+'prezzi combustibile'!$H$6)))","v":0},{"$f":"((esempio!$K$19*(esempio!$K$25/100))*(esempio!$K$26*(1+'prezzi combustibile'!$I$6)))","v":0},{"$f":"((esempio!$K$19*(esempio!$K$25/100))*(esempio!$K$26*(1+'prezzi combustibile'!$J$6)))","v":0},{"$f":"((esempio!$K$19*(esempio!$K$25/100))*(esempio!$K$26*(1+$K$6)))","v":0},{"$f":"((esempio!$K$19*(esempio!$K$25/100))*(esempio!$K$26*(1+$L$6)))","v":0},{"$f":"((esempio!$K$19*(esempio!$K$25/100))*(esempio!$K$26*(1+$M$6)))","v":0},{"$f":"((esempio!$K$19*(esempio!$K$25/100))*(esempio!$K$26*(1+$N$6)))","v":0},{"$f":"SUM(AE7:INDEX(AE7:AO7,esempio!$E$6))","v":0}]
[null,null,"carburante 2",{"$f":"IF(esempio!E23=\"Yes\",INDEX($G$42:$G$54,D5)/esempio!$E$6,0)","v":0},{"$f":"IF(esempio!G23=\"Yes\",INDEX($G$42:$G$54,E5)/esempio!$E$6,0)","v":0},{"$f":"IF(esempio!I23=\"Yes\",INDEX($G$42:$G$54,F5)/esempio!$E$6,0)","v":0},{"$f":"IF(esempio!K23=\"Yes\",INDEX($G$42:$G$54,G5)/esempio!$E$6,0)","v":0},{"$f":"IF(esempio!M23=\"Yes\",INDEX($G$42:$G$54,H5)/esempio!$E$6,0)","v":0},null,null,null,null,null,null,null,"Product 5",{"$f":"((esempio!$M$19*(esempio!$M$21/100))*esempio!$M$22)","v":0},{"$f":"((esempio!$M$19*(esempio!$M$21/100))*(esempio!$M$22*(1+'prezzi combustibile'!$E$6)))","v":0},{"$f":"((esempio!$M$19*(esempio!$M$21/100))*(esempio!$M$22*(1+'prezzi combustibile'!$F$6)))","v":0},{"$f":"((esempio!$M$19*(esempio!$M$21/100))*(esempio!$M$22*(1+'prezzi combustibile'!$G$6)))","v":0},{"$f":"((esempio!$M$19*(esempio!$M$21/100))*(esempio!$M$22*(1+'prezzi combustibile'!$H$6)))","v":0},{"$f":"((esempio!$M$19*(esempio!$M$21/100))*(esempio!$M$22*(1+'prezzi combustibile'!$I$6)))","v":0},{"$f":"((esempio!$M$19*(esempio!$M$21/100))*(esempio!$M$22*(1+'prezzi combustibile'!$J$6)))","v":0},{"$f":"((esempio!$M$19*(esempio!$M$21/100))*(esempio!$M$22*(1+'prezzi combustibile'!$K$6)))","v":0},{"$f":"((esempio!$M$19*(esempio!$M$21/100))*(esempio!$M$22*(1+'prezzi combustibile'!$L$6)))","v":0},{"$f":"((esempio!$M$19*(esempio!$M$21/100))*(esempio!$M$22*(1+'prezzi combustibile'!$M$6)))","v":0},{"$f":"((esempio!$M$19*(esempio!$M$21/100))*(esempio!$M$22*(1+'prezzi combustibile'!$N$6)))","v":0},{"$f":"SUM(Q8:INDEX(Q8:AA8,esempio!$M$6))","v":0},null,"Product 5",{"$f":"((esempio!$M$19*(esempio!$M$25/100))*esempio!$M$26)","v":0},{"$f":"((esempio!$M$19*(esempio!$M$25/100))*(esempio!$M$26*(1+'prezzi combustibile'!$E$6)))","v":0},{"$f":"((esempio!$M$19*(esempio!$M$25/100))*(esempio!$M$26*(1+'prezzi combustibile'!$F$6)))","v":0},{"$f":"((esempio!$M$19*(esempio!$M$25/100))*(esempio!$M$26*(1+'prezzi combustibile'!$G$6)))","v":0},{"$f":"((esempio!$M$19*(esempio!$M$25/100))*(esempio!$M$26*(1+'prezzi combustibile'!$H$6)))","v":0},{"$f":"((esempio!$M$19*(esempio!$M$25/100))*(esempio!$M$26*(1+'prezzi combustibile'!$I$6)))","v":0},{"$f":"((esempio!$M$19*(esempio!$M$25/100))*(esempio!$M$26*(1+'prezzi combustibile'!$J$6)))","v":0},{"$f":"((esempio!$M$19*(esempio!$M$25/100))*(esempio!$M$26*(1+$K$6)))","v":0},{"$f":"((esempio!$M$19*(esempio!$M$25/100))*(esempio!$M$26*(1+$L$6)))","v":0},{"$f":"((esempio!$M$19*(esempio!$M$25/100))*(esempio!$M$26*(1+$M$6)))","v":0},{"$f":"((esempio!$M$19*(esempio!$M$25/100))*(esempio!$M$26*(1+$N$6)))","v":0},{"$f":"SUM(AE8:INDEX(AE8:AO8,esempio!$E$6))","v":0}]
[null,null,"pagamento per periodo di carburante",{"$f":"SUM(D7:D8)","v":40497.079881975682},31508.467879532393,35650.232690811565,{"$error":"#N/A"},{"$error":"#N/A"}]
[null,null,"prezzo medio annuale batteria",{"$f":"AB54/esempio!$E$6+AB54/esempio!$E$6","v":15},{"$f":"AB55/esempio!$E$6+AB55/esempio!$E$6","v":0},{"$f":"AB56/esempio!$E$6+AB56/esempio!$E$6","v":0},{"$f":"AB57/esempio!$E$6+AB57/esempio!$E$6","v":0},{"$f":"AB58/esempio!$E$6+AB58/esempio!$E$6","v":0},null,null,null,null,null,null,null,"PETROL",2014,2015,2016,2017,2018,2019,2020,2021,2022,2023,2024,"Total fuel price for period",null,"PETROL",2014,2015,2016,2017,2018,2019,2020,2021,2022,2023,2024,"Total fuel price for period"]
[null,null,"prezzo carburante per litro scegliendo i valori (carburante 1)",{"$f":"IF(INDEX(esempio!$C$84:$D$95,'calcolo esempio'!D4,2)>0,esempio!$E$22-CUMIPMT(INDEX(esempio!$C$84:$D$95,'calcolo esempio'!D4,2),esempio!$E$6,esempio!$E$22,1,esempio!$E$6,1),esempio!$E$22*(1+(INDEX(esempio!$C$84:$D$94,'calcolo esempio'!D4,2))^esempio!$E$6))","v":1.22},{"$f":"IF(INDEX(esempio!$C$84:$D$95,'calcolo esempio'!E4,2)>0,esempio!$G$22-CUMIPMT(INDEX(esempio!$C$84:$D$95,'calcolo esempio'!E4,2),esempio!$E$6,esempio!$G$22,1,esempio!$E$6,1),esempio!$G$22*(1+(INDEX(esempio!$C$84:$D$94,'calcolo esempio'!E4,2))^esempio!$E$6))","v":1.22},{"$f":"IF(INDEX(esempio!$C$84:$D$95,'calcolo esempio'!F4,2)>0,esempio!$I$22-CUMIPMT(INDEX(esempio!$C$84:$D$95,'calcolo esempio'!F4,2),esempio!$E$6,esempio!$I$22,1,esempio!$E$6,1),esempio!$I$22*(1+(INDEX(esempio!$C$84:$D$94,'calcolo esempio'!F4,2))^esempio!$E$6))","v":3},{"$f":"IF(INDEX(esempio!$C$84:$D$95,'calcolo esempio'!G4,2)>0,esempio!$K$22-CUMIPMT(INDEX(esempio!$C$84:$D$95,'calcolo esempio'!G4,2),esempio!$E$6,esempio!$K$22,1,esempio!$E$6,1),esempio!$K$22*(1+(INDEX(esempio!$C$84:$D$94,'calcolo esempio'!G4,2))^esempio!$E$6))","v":{"$error":"#N/A"}},{"$f":"IF(INDEX(esempio!$C$84:$D$95,'calcolo esempio'!H4,2)>0,esempio!$M$22-CUMIPMT(INDEX(esempio!$C$84:$D$95,'calcolo esempio'!H4,2),esempio!$E$6,esempio!$M$22,1,esempio!$E$6,1),esempio!$M$22*(1+(INDEX(esempio!$C$84:$D$94,'calcolo esempio'!H4,2))^esempio!$E$6))","v":{"$error":"#N/A"}},null,null,null,null,null,null,null,"Product 1",{"$f":"((esempio!$E$19*(esempio!$E$21/100))*esempio!$E$22)","v":40894.400000000001},{"$f":"((esempio!$E$19*(esempio!$E$21/100))*(esempio!$E$22*(1+'prezzi combustibile'!$E$6)))","v":39348.945563063855},{"$f":"((esempio!$E$19*(esempio!$E$21/100))*(esempio!$E$22*(1+'prezzi combustibile'!$F$6)))","v":38784.603092298101},{"$f":"((esempio!$E$19*(esempio!$E$21/100))*(esempio!$E$22*(1+'prezzi combustibile'!$G$6)))","v":38807.032151845939},{"$f":"((esempio!$E$19*(esempio!$E$21/100))*(esempio!$E$22*(1+'prezzi combustibile'!$H$6)))","v":39236.517252013509},{"$f":"((esempio!$E$19*(esempio!$E$21/100))*(esempio!$E$22*(1+'prezzi combustibile'!$I$6)))","v":40124.655521807399},{"$f":"((esempio!$E$19*(esempio!$E$21/100))*(esempio!$E$22*(1+'prezzi combustibile'!$J$6)))","v":40818.484510988194},{"$f":"((esempio!$E$19*(esempio!$E$21/100))*(esempio!$E$22*(1+'prezzi combustibile'!$K$6)))","v":41585.02445823585},{"$f":"((esempio!$E$19*(esempio!$E$21/100))*(esempio!$E$22*(1+'prezzi combustibile'!$L$6)))","v":42405.645090833677},{"$f":"((esempio!$E$19*(esempio!$E$21/100))*(esempio!$E$22*(1+'prezzi combustibile'!$M$6)))","v":42965.491178670309},{"$f":"((esempio!$E$19*(esempio!$E$21/100))*(esempio!$E$22*(1+'prezzi combustibile'!$N$6)))","v":43494.950470232572},{"$f":"SUM(Q11:INDEX(Q11:AA11,esempio!$E$6))","v":404970.79881975683},null,"Product 1",{"$f":"((esempio!$E$19*(esempio!$E$25/100))*esempio!$E$26)","v":0},{"$f":"((esempio!$E$19*(esempio!$E$25/100))*(esempio!$E$26*(1+'prezzi combustibile'!$E$6)))","v":0},{"$f":"((esempio!$E$19*(esempio!$E$25/100))*(esempio!$E$26*(1+'prezzi combustibile'!$F$6)))","v":0},{"$f":"((esempio!$E$19*(esempio!$E$25/100))*(esempio!$E$26*(1+'prezzi combustibile'!$G$6)))","v":0},{"$f":"((esempio!$E$19*(esempio!$E$25/100))*(esempio!$E$26*(1+'prezzi combustibile'!$H$6)))","v":0},{"$f":"((esempio!$E$19*(esempio!$E$25/100))*(esempio!$E$26*(1+'prezzi combustibile'!$I$6)))","v":0},{"$f":"((esempio!$E$19*(esempio!$E$25/100))*(esempio!$E$26*(1+'prezzi combustibile'!$J$6)))","v":0},{"$f":"((esempio!$E$19*(esempio!$E$25/100))*(esempio!$E$26*(1+$K$6)))","v":0},{"$f":"((esempio!$E$19*(esempio!$E$25/100))*(esempio!$E$26*(1+$L$6)))","v":0},{"$f":"((esempio!$E$19*(esempio!$E$25/100))*(esempio!$E$26*(1+$M$6)))","v":0},{"$f":"((esempio!$E$19*(esempio!$E$25/100))*(esempio!$E$26*(1+$N$6)))","v":0},{"$f":"SUM(AE11:INDEX(AE11:AO11,esempio!$E$6))","v":0}]
[null,null,"prezzo carburante per litro scegliendo i valori (carburante 2)",null,{"$f":"IF(INDEX(esempio!$C$84:$D$95,'calcolo esempio'!E4,2)>0,esempio!G26-CUMIPMT(INDEX(esempio!$C$84:$D$95,'calcolo esempio'!E4,2),esempio!$E$6,esempio!G26,1,esempio!$E$6,1),esempio!G26*(1+(INDEX(esempio!$C$84:$D$94,'calcolo esempio'!E4,2))^esempio!$E$6))","v":1},{"$f":"IF(INDEX(esempio!$C$84:$D$95,'calcolo esempio'!F4,2)>0,esempio!I26-CUMIPMT(INDEX(esempio!$C$84:$D$95,'calcolo esempio'!F4,2),esempio!$E$6,esempio!I26,1,esempio!$E$6,1),esempio!I26*(1+(INDEX(esempio!$C$84:$D$94,'calcolo esempio'!F4,2))^esempio!$E$6))","v":0},{"$f":"IF(INDEX(esempio!$C$84:$D$95,'calcolo esempio'!G4,2)>0,esempio!K26-CUMIPMT(INDEX(esempio!$C$84:$D$95,'calcolo esempio'!G4,2),esempio!$E$6,esempio!K26,1,esempio!$E$6,1),esempio!K26*(1+(INDEX(esempio!$C$84:$D$94,'calcolo esempio'!G4,2))^esempio!$E$6))","v":{"$error":"#N/A"}},{"$f":"IF(INDEX(esempio!$C$84:$D$95,'calcolo esempio'!H4,2)>0,esempio!M26-CUMIPMT(INDEX(esempio!$C$84:$D$95,'calcolo esempio'!H4,2),esempio!$E$6,esempio!M26,1,esempio!$E$6,1),esempio!M26*(1+(INDEX(esempio!$C$84:$D$94,'calcolo esempio'!H4,2))^esempio!$E$6))","v":{"$error":"#N/A"}},null,null,null,null,null,null,null,"Product 2",{"$f":"((esempio!$G$19*(esempio!$G$21/100))*esempio!$G$22)","v":31817.599999999999},{"$f":"((esempio!$G$19*(esempio!$G$21/100))*(esempio!$G$22*(1+'prezzi combustibile'!$E$6)))","v":30615.170056226292},{"$f":"((esempio!$G$19*(esempio!$G$21/100))*(esempio!$G$22*(1+'prezzi combustibile'!$F$6)))","v":30176.087370141242},{"$f":"((esempio!$G$19*(esempio!$G$21/100))*(esempio!$G$22*(1+'prezzi combustibile'!$G$6)))","v":30193.538142009013},{"$f":"((esempio!$G$19*(esempio!$G$21/100))*(esempio!$G$22*(1+'prezzi combustibile'!$H$6)))","v":30527.696000373278},{"$f":"((esempio!$G$19*(esempio!$G$21/100))*(esempio!$G$22*(1+'prezzi combustibile'!$I$6)))","v":31218.705728184275},{"$f":"((esempio!$G$19*(esempio!$G$21/100))*(esempio!$G$22*(1+'prezzi combustibile'!$J$6)))","v":31758.534488262892},{"$f":"((esempio!$G$19*(esempio!$G$21/100))*(esempio!$G$22*(1+'prezzi combustibile'!$K$6)))","v":32354.935497338633},{"$f":"((esempio!$G$19*(esempio!$G$21/100))*(esempio!$G$22*(1+'prezzi combustibile'!$L$6)))","v":32993.413602892077},{"$f":"((esempio!$G$19*(esempio!$G$21/100))*(esempio!$G$22*(1+'prezzi combustibile'!$M$6)))","v":33428.997909896229},{"$f":"((esempio!$G$19*(esempio!$G$21/100))*(esempio!$G$22*(1+'prezzi combustibile'!$N$6)))","v":33840.939983999568},{"$f":"SUM(Q12:INDEX(Q12:AA12,esempio!$G$6))","v":315084.67879532394},null,"Product 2",{"$f":"((esempio!$G$19*(esempio!$G$25/100))*esempio!$G$26)","v":200000},{"$f":"((esempio!$G$19*(esempio!$G$25/100))*(esempio!$G$26*(1+'prezzi combustibile'!$E$6)))","v":192441.73071649836},{"$f":"((esempio!$G$19*(esempio!$G$25/100))*(esempio!$G$26*(1+'prezzi combustibile'!$F$6)))","v":189681.73193541463},{"$f":"((esempio!$G$19*(esempio!$G$25/100))*(esempio!$G$26*(1+'prezzi combustibile'!$G$6)))","v":189791.42450724763},{"$f":"((esempio!$G$19*(esempio!$G$25/100))*(esempio!$G$26*(1+'prezzi combustibile'!$H$6)))","v":191891.88373964897},{"$f":"((esempio!$G$19*(esempio!$G$25/100))*(esempio!$G$26*(1+'prezzi combustibile'!$I$6)))","v":196235.45288258244},{"$f":"((esempio!$G$19*(esempio!$G$25/100))*(esempio!$G$26*(1+'prezzi combustibile'!$J$6)))","v":199628.72428003929},{"$f":"((esempio!$G$19*(esempio!$G$25/100))*(esempio!$G$26*(1+$K$6)))","v":200000},{"$f":"((esempio!$G$19*(esempio!$G$25/100))*(esempio!$G$26*(1+$L$6)))","v":200000},{"$f":"((esempio!$G$19*(esempio!$G$25/100))*(esempio!$G$26*(1+$M$6)))","v":200000},{"$f":"((esempio!$G$19*(esempio!$G$25/100))*(esempio!$G$26*(1+$N$6)))","v":200000},{"$f":"SUM(AE12:INDEX(AE12:AO12,esempio!$E$6))","v":1959670.9480614313}]
[null,null,"carburante consumption per vehicle (carburante 1)",{"$f":"esempio!E$21","v":41.9},{"$f":"esempio!G$21","v":32.6},{"$f":"esempio!I$21","v":60},{"$f":"esempio!K$21","v":0},{"$f":"esempio!M$21","v":0},null,null,null,null,null,null,null,"Product 3",{"$f":"((esempio!$I$19*(esempio!$I$21/100))*esempio!$I$22)","v":36000},{"$f":"((esempio!$I$19*(esempio!$I$21/100))*(esempio!$I$22*(1+'prezzi combustibile'!$E$6)))","v":34639.511528969706},{"$f":"((esempio!$I$19*(esempio!$I$21/100))*(esempio!$I$22*(1+'prezzi combustibile'!$F$6)))","v":34142.711748374633},{"$f":"((esempio!$I$19*(esempio!$I$21/100))*(esempio!$I$22*(1+'prezzi combustibile'!$G$6)))","v":34162.456411304578},{"$f":"((esempio!$I$19*(esempio!$I$21/100))*(esempio!$I$22*(1+'prezzi combustibile'!$H$6)))","v":34540.539073136817},{"$f":"((esempio!$I$19*(esempio!$I$21/100))*(esempio!$I$22*(1+'prezzi combustibile'!$I$6)))","v":35322.381518864837},{"$f":"((esempio!$I$19*(esempio!$I$21/100))*(esempio!$I$22*(1+'prezzi combustibile'!$J$6)))","v":35933.170370407068},{"$f":"((esempio!$I$19*(esempio!$I$21/100))*(esempio!$I$22*(1+'prezzi combustibile'!$K$6)))","v":36607.96785125813},{"$f":"((esempio!$I$19*(esempio!$I$21/100))*(esempio!$I$22*(1+'prezzi combustibile'!$L$6)))","v":37330.373431814936},{"$f":"((esempio!$I$19*(esempio!$I$21/100))*(esempio!$I$22*(1+'prezzi combustibile'!$M$6)))","v":37823.21497398497},{"$f":"((esempio!$I$19*(esempio!$I$21/100))*(esempio!$I$22*(1+'prezzi combustibile'!$N$6)))","v":38289.306529216054},{"$f":"SUM(Q13:INDEX(Q13:AA13,esempio!$I$6))","v":356502.32690811565},null,"Product 3",{"$f":"((esempio!$I$19*(esempio!$I$25/100))*esempio!$I$26)","v":0},{"$f":"((esempio!$I$19*(esempio!$I$25/100))*(esempio!$I$26*(1+'prezzi combustibile'!$E$6)))","v":0},{"$f":"((esempio!$I$19*(esempio!$I$25/100))*(esempio!$I$26*(1+'prezzi combustibile'!$F$6)))","v":0},{"$f":"((esempio!$I$19*(esempio!$I$25/100))*(esempio!$I$26*(1+'prezzi combustibile'!$G$6)))","v":0},{"$f":"((esempio!$I$19*(esempio!$I$25/100))*(esempio!$I$26*(1+'prezzi combustibile'!$H$6)))","v":0},{"$f":"((esempio!$I$19*(esempio!$I$25/100))*(esempio!$I$26*(1+'prezzi combustibile'!$I$6)))","v":0},{"$f":"((esempio!$I$19*(esempio!$I$25/100))*(esempio!$I$26*(1+'prezzi combustibile'!$J$6)))","v":0},{"$f":"((esempio!$I$19*(esempio!$I$25/100))*(esempio!$I$26*(1+$K$6)))","v":0},{"$f":"((esempio!$I$19*(esempio!$I$25/100))*(esempio!$I$26*(1+$L$6)))","v":0},{"$f":"((esempio!$I$19*(esempio!$I$25/100))*(esempio!$I$26*(1+$M$6)))","v":0},{"$f":"((esempio!$I$19*(esempio!$I$25/100))*(esempio!$I$26*(1+$N$6)))","v":0},{"$f":"SUM(AE13:INDEX(AE13:AO13,esempio!$E$6))","v":0}]
[null,null,"contenuto energetico (carburante 1)",{"$f":"INDEX($C$26:$C$38,D$4)","v":36},36,33,{"$error":"#N/A"},{"$error":"#N/A"},null,null,null,null,null,null,null,"Product 4",{"$f":"((esempio!$K$19*(esempio!$K$21/100))*esempio!$K$22)","v":0},{"$f":"((esempio!$K$19*(esempio!$K$21/100))*(esempio!$K$22*(1+'prezzi combustibile'!$E$6)))","v":0},{"$f":"((esempio!$K$19*(esempio!$K$21/100))*(esempio!$K$22*(1+'prezzi combustibile'!$F$6)))","v":0},{"$f":"((esempio!$K$19*(esempio!$K$21/100))*(esempio!$K$22*(1+'prezzi combustibile'!$G$6)))","v":0},{"$f":"((esempio!$K$19*(esempio!$K$21/100))*(esempio!$K$22*(1+'prezzi combustibile'!$H$6)))","v":0},{"$f":"((esempio!$K$19*(esempio!$K$21/100))*(esempio!$K$22*(1+'prezzi combustibile'!$I$6)))","v":0},{"$f":"((esempio!$K$19*(esempio!$K$21/100))*(esempio!$K$22*(1+'prezzi combustibile'!$J$6)))","v":0},{"$f":"((esempio!$K$19*(esempio!$K$21/100))*(esempio!$K$22*(1+'prezzi combustibile'!$K$6)))","v":0},{"$f":"((esempio!$K$19*(esempio!$K$21/100))*(esempio!$K$22*(1+'prezzi combustibile'!$L$6)))","v":0},{"$f":"((esempio!$K$19*(esempio!$K$21/100))*(esempio!$K$22*(1+'prezzi combustibile'!$M$6)))","v":0},{"$f":"((esempio!$K$19*(esempio!$K$21/100))*(esempio!$K$22*(1+'prezzi combustibile'!$N$6)))","v":0},{"$f":"SUM(Q14:INDEX(Q14:AA14,esempio!$K$6))","v":0},null,"Product 4",{"$f":"((esempio!$K$19*(esempio!$K$25/100))*esempio!$K$26)","v":0},{"$f":"((esempio!$K$19*(esempio!$K$25/100))*(esempio!$K$26*(1+'prezzi combustibile'!$E$6)))","v":0},{"$f":"((esempio!$K$19*(esempio!$K$25/100))*(esempio!$K$26*(1+'prezzi combustibile'!$F$6)))","v":0},{"$f":"((esempio!$K$19*(esempio!$K$25/100))*(esempio!$K$26*(1+'prezzi combustibile'!$G$6)))","v":0},{"$f":"((esempio!$K$19*(esempio!$K$25/100))*(esempio!$K$26*(1+'prezzi combustibile'!$H$6)))","v":0},{"$f":"((esempio!$K$19*(esempio!$K$25/100))*(esempio!$K$26*(1+'prezzi combustibile'!$I$6)))","v":0},{"$f":"((esempio!$K$19*(esempio!$K$25/100))*(esempio!$K$26*(1+'prezzi combustibile'!$J$6)))","v":0},{"$f":"((esempio!$K$19*(esempio!$K$25/100))*(esempio!$K$26*(1+$K$6)))","v":0},{"$f":"((esempio!$K$19*(esempio!$K$25/100))*(esempio!$K$26*(1+$L$6)))","v":0},{"$f":"((esempio!$K$19*(esempio!$K$25/100))*(esempio!$K$26*(1+$M$6)))","v":0},{"$f":"((esempio!$K$19*(esempio!$K$25/100))*(esempio!$K$26*(1+$N$6)))","v":0},{"$f":"SUM(AE14:INDEX(AE14:AO14,esempio!$E$6))","v":0}]
[null,null,"consumo carburante per veicolo (carburante 2)",{"$f":"esempio!E$25","v":0},{"$f":"esempio!G$25","v":250},{"$f":"esempio!I$25","v":0},{"$f":"esempio!K$25","v":0},{"$f":"esempio!M$25","v":0},null,null,null,null,null,null,null,"Product 5",{"$f":"((esempio!$M$19*(esempio!$M$21/100))*esempio!$M$22)","v":0},{"$f":"((esempio!$M$19*(esempio!$M$21/100))*(esempio!$M$22*(1+'prezzi combustibile'!$E$6)))","v":0},{"$f":"((esempio!$M$19*(esempio!$M$21/100))*(esempio!$M$22*(1+'prezzi combustibile'!$F$6)))","v":0},{"$f":"((esempio!$M$19*(esempio!$M$21/100))*(esempio!$M$22*(1+'prezzi combustibile'!$G$6)))","v":0},{"$f":"((esempio!$M$19*(esempio!$M$21/100))*(esempio!$M$22*(1+'prezzi combustibile'!$H$6)))","v":0},{"$f":"((esempio!$M$19*(esempio!$M$21/100))*(esempio!$M$22*(1+'prezzi combustibile'!$I$6)))","v":0},{"$f":"((esempio!$M$19*(esempio!$M$21/100))*(esempio!$M$22*(1+'prezzi combustibile'!$J$6)))","v":0},{"$f":"((esempio!$M$19*(esempio!$M$21/100))*(esempio!$M$22*(1+'prezzi combustibile'!$K$6)))","v":0},{"$f":"((esempio!$M$19*(esempio!$M$21/100))*(esempio!$M$22*(1+'prezzi combustibile'!$L$6)))","v":0},{"$f":"((esempio!$M$19*(esempio!$M$21/100))*(esempio!$M$22*(1+'prezzi combustibile'!$M$6)))","v":0},{"$f":"((esempio!$M$19*(esempio!$M$21/100))*(esempio!$M$22*(1+'prezzi combustibile'!$N$6)))","v":0},{"$f":"SUM(Q15:INDEX(Q15:AA15,esempio!$M$6))","v":0},null,"Product 5",{"$f":"((esempio!$M$19*(esempio!$M$25/100))*esempio!$M$26)","v":0},{"$f":"((esempio!$M$19*(esempio!$M$25/100))*(esempio!$M$26*(1+'prezzi combustibile'!$E$6)))","v":0},{"$f":"((esempio!$M$19*(esempio!$M$25/100))*(esempio!$M$26*(1+'prezzi combustibile'!$F$6)))","v":0},{"$f":"((esempio!$M$19*(esempio!$M$25/100))*(esempio!$M$26*(1+'prezzi combustibile'!$G$6)))","v":0},{"$f":"((esempio!$M$19*(esempio!$M$25/100))*(esempio!$M$26*(1+'prezzi combustibile'!$H$6)))","v":0},{"$f":"((esempio!$M$19*(esempio!$M$25/100))*(esempio!$M$26*(1+'prezzi combustibile'!$I$6)))","v":0},{"$f":"((esempio!$M$19*(esempio!$M$25/100))*(esempio!$M$26*(1+'prezzi combustibile'!$J$6)))","v":0},{"$f":"((esempio!$M$19*(esempio!$M$25/100))*(esempio!$M$26*(1+$K$6)))","v":0},{"$f":"((esempio!$M$19*(esempio!$M$25/100))*(esempio!$M$26*(1+$L$6)))","v":0},{"$f":"((esempio!$M$19*(esempio!$M$25/100))*(esempio!$M$26*(1+$M$6)))","v":0},{"$f":"((esempio!$M$19*(esempio!$M$25/100))*(esempio!$M$26*(1+$N$6)))","v":0},{"$f":"SUM(AE15:INDEX(AE15:AO15,esempio!$E$6))","v":0}]
[null,null,"contenuto energetico (carburante 2)",null,{"$f":"INDEX($C$42:$C$54,E$5)","v":32},{"$error":"#N/A"},{"$error":"#N/A"},{"$error":"#N/A"}]
[null,null,"consumo energetico (MJ/km)",{"$f":"((D13/100)*D14)+((D15/100)*D16)","v":15.084},91.736000000000004,{"$error":"#N/A"},{"$error":"#N/A"},{"$error":"#N/A"},null,null,null,null,null,null,null,"LPG",2014,2015,2016,2017,2018,2019,2020,2021,2022,2023,2024,"Total fuel price for period",null,"LPG",2014,2015,2016,2017,2018,2019,2020,2021,2022,2023,2024,"Total fuel price for period"]
[null,null,"Costo al litro del carburante di riferimento (€/l)",{"$f":"esempio!E$60","v":1.01},{"$f":"esempio!G$60","v":1.01},{"$f":"esempio!I$60","v":0},{"$f":"esempio!K$60","v":0},{"$f":"esempio!M$60","v":0},null,null,null,null,null,null,null,"Product 1",{"$f":"((esempio!$E$19*(esempio!$E$21/100))*esempio!$E$22)","v":40894.400000000001},{"$f":"((esempio!$E$19*(esempio!$E$21/100))*(esempio!$E$22*(1+'prezzi combustibile'!$E$6)))","v":39348.945563063855},{"$f":"((esempio!$E$19*(esempio!$E$21/100))*(esempio!$E$22*(1+'prezzi combustibile'!$F$6)))","v":38784.603092298101},{"$f":"((esempio!$E$19*(esempio!$E$21/100))*(esempio!$E$22*(1+'prezzi combustibile'!$G$6)))","v":38807.032151845939},{"$f":"((esempio!$E$19*(esempio!$E$21/100))*(esempio!$E$22*(1+'prezzi combustibile'!$H$6)))","v":39236.517252013509},{"$f":"((esempio!$E$19*(esempio!$E$21/100))*(esempio!$E$22*(1+'prezzi combustibile'!$I$6)))","v":40124.655521807399},{"$f":"((esempio!$E$19*(esempio!$E$21/100))*(esempio!$E$22*(1+'prezzi combustibile'!$J$6)))","v":40818.484510988194},{"$f":"((esempio!$E$19*(esempio!$E$21/100))*(esempio!$E$22*(1+'prezzi combustibile'!$K$6)))","v":41585.02445823585},{"$f":"((esempio!$E$19*(esempio!$E$21/100))*(esempio!$E$22*(1+'prezzi combustibile'!$L$6)))","v":42405.645090833677},{"$f":"((esempio!$E$19*(esempio!$E$21/100))*(esempio!$E$22*(1+'prezzi combustibile'!$M$6)))","v":42965.491178670309},{"$f":"((esempio!$E$19*(esempio!$E$21/100))*(esempio!$E$22*(1+'prezzi combustibile'!$N$6)))","v":43494.950470232572},{"$f":"SUM(Q18:INDEX(Q18:AA18,esempio!$E$6))","v":404970.79881975683},null,"Product 1",{"$f":"((esempio!$E$19*(esempio!$E$25/100))*esempio!$E$26)","v":0},{"$f":"((esempio!$E$19*(esempio!$E$25/100))*(esempio!$E$26*(1+'prezzi combustibile'!$E$6)))","v":0},{"$f":"((esempio!$E$19*(esempio!$E$25/100))*(esempio!$E$26*(1+'prezzi combustibile'!$F$6)))","v":0},{"$f":"((esempio!$E$19*(esempio!$E$25/100))*(esempio!$E$26*(1+'prezzi combustibile'!$G$6)))","v":0},{"$f":"((esempio!$E$19*(esempio!$E$25/100))*(esempio!$E$26*(1+'prezzi combustibile'!$H$6)))","v":0},{"$f":"((esempio!$E$19*(esempio!$E$25/100))*(esempio!$E$26*(1+'prezzi combustibile'!$I$6)))","v":0},{"$f":"((esempio!$E$19*(esempio!$E$25/100))*(esempio!$E$26*(1+'prezzi combustibile'!$J$6)))","v":0},{"$f":"((esempio!$E$19*(esempio!$E$25/100))*(esempio!$E$26*(1+$K$6)))","v":0},{"$f":"((esempio!$E$19*(esempio!$E$25/100))*(esempio!$E$26*(1+$L$6)))","v":0},{"$f":"((esempio!$E$19*(esempio!$E$25/100))*(esempio!$E$26*(1+$M$6)))","v":0},{"$f":"((esempio!$E$19*(esempio!$E$25/100))*(esempio!$E$26*(1+$N$6)))","v":0},{"$f":"SUM(AE18:INDEX(AE18:AO18,esempio!$E$6))","v":0}]
[null,null,"contenuto energetico carburante di riferimento",{"$f":"IF($D$6=1,C26, IF($D$6=2,C27, \"INCORRECT\"))","v":36},{"$f":"IF(E$6=1,$C$26, IF(E$6=2,$C$27, \"INCORRECT\"))","v":36},{"$f":"IF(F$6=1,$C$26, IF(F$6=2,$C$27, \"INCORRECT\"))","v":"INCORRECT"},{"$f":"IF(G$6=1,$C$26, IF(G$6=2,$C$27, \"INCORRECT\"))","v":"INCORRECT"},{"$f":"IF(H$6=1,$C$26, IF(H$6=2,$C$27, \"INCORRECT\"))","v":"INCORRECT"},null,null,null,null,null,null,null,"Product 2",{"$f":"((esempio!$G$19*(esempio!$G$21/100))*esempio!$G$22)","v":31817.599999999999},{"$f":"((esempio!$G$19*(esempio!$G$21/100))*(esempio!$G$22*(1+'prezzi combustibile'!$E$6)))","v":30615.170056226292},{"$f":"((esempio!$G$19*(esempio!$G$21/100))*(esempio!$G$22*(1+'prezzi combustibile'!$F$6)))","v":30176.087370141242},{"$f":"((esempio!$G$19*(esempio!$G$21/100))*(esempio!$G$22*(1+'prezzi combustibile'!$G$6)))","v":30193.538142009013},{"$f":"((esempio!$G$19*(esempio!$G$21/100))*(esempio!$G$22*(1+'prezzi combustibile'!$H$6)))","v":30527.696000373278},{"$f":"((esempio!$G$19*(esempio!$G$21/100))*(esempio!$G$22*(1+'prezzi combustibile'!$I$6)))","v":31218.705728184275},{"$f":"((esempio!$G$19*(esempio!$G$21/100))*(esempio!$G$22*(1+'prezzi combustibile'!$J$6)))","v":31758.534488262892},{"$f":"((esempio!$G$19*(esempio!$G$21/100))*(esempio!$G$22*(1+'prezzi combustibile'!$K$6)))","v":32354.935497338633},{"$f":"((esempio!$G$19*(esempio!$G$21/100))*(esempio!$G$22*(1+'prezzi combustibile'!$L$6)))","v":32993.413602892077},{"$f":"((esempio!$G$19*(esempio!$G$21/100))*(esempio!$G$22*(1+'prezzi combustibile'!$M$6)))","v":33428.997909896229},{"$f":"((esempio!$G$19*(esempio!$G$21/100))*(esempio!$G$22*(1+'prezzi combustibile'!$N$6)))","v":33840.939983999568},{"$f":"SUM(Q19:INDEX(Q19:AA19,esempio!$G$6))","v":315084.67879532394},null,"Product 2",{"$f":"((esempio!$G$19*(esempio!$G$25/100))*esempio!$G$26)","v":200000},{"$f":"((esempio!$G$19*(esempio!$G$25/100))*(esempio!$G$26*(1+'prezzi combustibile'!$E$6)))","v":192441.73071649836},{"$f":"((esempio!$G$19*(esempio!$G$25/100))*(esempio!$G$26*(1+'prezzi combustibile'!$F$6)))","v":189681.73193541463},{"$f":"((esempio!$G$19*(esempio!$G$25/100))*(esempio!$G$26*(1+'prezzi combustibile'!$G$6)))","v":189791.42450724763},{"$f":"((esempio!$G$19*(esempio!$G$25/100))*(esempio!$G$26*(1+'prezzi combustibile'!$H$6)))","v":191891.88373964897},{"$f":"((esempio!$G$19*(esempio!$G$25/100))*(esempio!$G$26*(1+'prezzi combustibile'!$I$6)))","v":196235.45288258244},{"$f":"((esempio!$G$19*(esempio!$G$25/100))*(esempio!$G$26*(1+'prezzi combustibile'!$J$6)))","v":199628.72428003929},{"$f":"((esempio!$G$19*(esempio!$G$25/100))*(esempio!$G$26*(1+$K$6)))","v":200000},{"$f":"((esempio!$G$19*(esempio!$G$25/100))*(esempio!$G$26*(1+$L$6)))","v":200000},{"$f":"((esempio!$G$19*(esempio!$G$25/100))*(esempio!$G$26*(1+$M$6)))","v":200000},{"$f":"((esempio!$G$19*(esempio!$G$25/100))*(esempio!$G$26*(1+$N$6)))","v":200000},{"$f":"SUM(AE19:INDEX(AE19:AO19,esempio!$E$6))","v":1959670.9480614313}]
[null,null,"Costo per unità di energia (€/MJ)",{"$f":"D18/D19","v":2.8055555555555556E-2},2.8055555555555556E-2,{"$error":"#VALUE!"},{"$error":"#VALUE!"},{"$error":"#VALUE!"},null,null,null,null,null,null,null,"Product 3",{"$f":"((esempio!$I$19*(esempio!$I$21/100))*esempio!$I$22)","v":36000},{"$f":"((esempio!$I$19*(esempio!$I$21/100))*(esempio!$I$22*(1+'prezzi combustibile'!$E$6)))","v":34639.511528969706},{"$f":"((esempio!$I$19*(esempio!$I$21/100))*(esempio!$I$22*(1+'prezzi combustibile'!$F$6)))","v":34142.711748374633},{"$f":"((esempio!$I$19*(esempio!$I$21/100))*(esempio!$I$22*(1+'prezzi combustibile'!$G$6)))","v":34162.456411304578},{"$f":"((esempio!$I$19*(esempio!$I$21/100))*(esempio!$I$22*(1+'prezzi combustibile'!$H$6)))","v":34540.539073136817},{"$f":"((esempio!$I$19*(esempio!$I$21/100))*(esempio!$I$22*(1+'prezzi combustibile'!$I$6)))","v":35322.381518864837},{"$f":"((esempio!$I$19*(esempio!$I$21/100))*(esempio!$I$22*(1+'prezzi combustibile'!$J$6)))","v":35933.170370407068},{"$f":"((esempio!$I$19*(esempio!$I$21/100))*(esempio!$I$22*(1+'prezzi combustibile'!$K$6)))","v":36607.96785125813},{"$f":"((esempio!$I$19*(esempio!$I$21/100))*(esempio!$I$22*(1+'prezzi combustibile'!$L$6)))","v":37330.373431814936},{"$f":"((esempio!$I$19*(esempio!$I$21/100))*(esempio!$I$22*(1+'prezzi combustibile'!$M$6)))","v":37823.21497398497},{"$f":"((esempio!$I$19*(esempio!$I$21/100))*(esempio!$I$22*(1+'prezzi combustibile'!$N$6)))","v":38289.306529216054},{"$f":"SUM(Q20:INDEX(Q20:AA20,esempio!$I$6))","v":356502.32690811565},null,"Product 3",{"$f":"((esempio!$I$19*(esempio!$I$25/100))*esempio!$I$26)","v":0},{"$f":"((esempio!$I$19*(esempio!$I$25/100))*(esempio!$I$26*(1+'prezzi combustibile'!$E$6)))","v":0},{"$f":"((esempio!$I$19*(esempio!$I$25/100))*(esempio!$I$26*(1+'prezzi combustibile'!$F$6)))","v":0},{"$f":"((esempio!$I$19*(esempio!$I$25/100))*(esempio!$I$26*(1+'prezzi combustibile'!$G$6)))","v":0},{"$f":"((esempio!$I$19*(esempio!$I$25/100))*(esempio!$I$26*(1+'prezzi combustibile'!$H$6)))","v":0},{"$f":"((esempio!$I$19*(esempio!$I$25/100))*(esempio!$I$26*(1+'prezzi combustibile'!$I$6)))","v":0},{"$f":"((esempio!$I$19*(esempio!$I$25/100))*(esempio!$I$26*(1+'prezzi combustibile'!$J$6)))","v":0},{"$f":"((esempio!$I$19*(esempio!$I$25/100))*(esempio!$I$26*(1+$K$6)))","v":0},{"$f":"((esempio!$I$19*(esempio!$I$25/100))*(esempio!$I$26*(1+$L$6)))","v":0},{"$f":"((esempio!$I$19*(esempio!$I$25/100))*(esempio!$I$26*(1+$M$6)))","v":0},{"$f":"((esempio!$I$19*(esempio!$I$25/100))*(esempio!$I$26*(1+$N$6)))","v":0},{"$f":"SUM(AE20:INDEX(AE20:AO20,esempio!$E$6))","v":0}]
[null,null,"chilometraggio di vita (km)",{"$f":"esempio!E19*esempio!E$6","v":800000},{"$f":"esempio!G19*esempio!G$6","v":800000},{"$f":"esempio!I19*esempio!I$6","v":200000},{"$f":"esempio!K19*esempio!K$6","v":0},{"$f":"esempio!M19*esempio!M$6","v":0},null,null,null,null,null,null,null,"Product 4",{"$f":"((esempio!$K$19*(esempio!$K$21/100))*esempio!$K$22)","v":0},{"$f":"((esempio!$K$19*(esempio!$K$21/100))*(esempio!$K$22*(1+'prezzi combustibile'!$E$6)))","v":0},{"$f":"((esempio!$K$19*(esempio!$K$21/100))*(esempio!$K$22*(1+'prezzi combustibile'!$F$6)))","v":0},{"$f":"((esempio!$K$19*(esempio!$K$21/100))*(esempio!$K$22*(1+'prezzi combustibile'!$G$6)))","v":0},{"$f":"((esempio!$K$19*(esempio!$K$21/100))*(esempio!$K$22*(1+'prezzi combustibile'!$H$6)))","v":0},{"$f":"((esempio!$K$19*(esempio!$K$21/100))*(esempio!$K$22*(1+'prezzi combustibile'!$I$6)))","v":0},{"$f":"((esempio!$K$19*(esempio!$K$21/100))*(esempio!$K$22*(1+'prezzi combustibile'!$J$6)))","v":0},{"$f":"((esempio!$K$19*(esempio!$K$21/100))*(esempio!$K$22*(1+'prezzi combustibile'!$K$6)))","v":0},{"$f":"((esempio!$K$19*(esempio!$K$21/100))*(esempio!$K$22*(1+'prezzi combustibile'!$L$6)))","v":0},{"$f":"((esempio!$K$19*(esempio!$K$21/100))*(esempio!$K$22*(1+'prezzi combustibile'!$M$6)))","v":0},{"$f":"((esempio!$K$19*(esempio!$K$21/100))*(esempio!$K$22*(1+'prezzi combustibile'!$N$6)))","v":0},{"$f":"SUM(Q21:INDEX(Q21:AA21,esempio!$K$6))","v":0},null,"Product 4",{"$f":"((esempio!$K$19*(esempio!$K$25/100))*esempio!$K$26)","v":0},{"$f":"((esempio!$K$19*(esempio!$K$25/100))*(esempio!$K$26*(1+'prezzi combustibile'!$E$6)))","v":0},{"$f":"((esempio!$K$19*(esempio!$K$25/100))*(esempio!$K$26*(1+'prezzi combustibile'!$F$6)))","v":0},{"$f":"((esempio!$K$19*(esempio!$K$25/100))*(esempio!$K$26*(1+'prezzi combustibile'!$G$6)))","v":0},{"$f":"((esempio!$K$19*(esempio!$K$25/100))*(esempio!$K$26*(1+'prezzi combustibile'!$H$6)))","v":0},{"$f":"((esempio!$K$19*(esempio!$K$25/100))*(esempio!$K$26*(1+'prezzi combustibile'!$I$6)))","v":0},{"$f":"((esempio!$K$19*(esempio!$K$25/100))*(esempio!$K$26*(1+'prezzi combustibile'!$J$6)))","v":0},{"$f":"((esempio!$K$19*(esempio!$K$25/100))*(esempio!$K$26*(1+$K$6)))","v":0},{"$f":"((esempio!$K$19*(esempio!$K$25/100))*(esempio!$K$26*(1+$L$6)))","v":0},{"$f":"((esempio!$K$19*(esempio!$K$25/100))*(esempio!$K$26*(1+$M$6)))","v":0},{"$f":"((esempio!$K$19*(esempio!$K$25/100))*(esempio!$K$26*(1+$N$6)))","v":0},{"$f":"SUM(AE21:INDEX(AE21:AO21,esempio!$E$6))","v":0}]
[null,null,"costo di vita del consumo energetico (€)",{"$f":"D17*D20*D21","v":338552},2058963.5555555557,{"$error":"#N/A"},{"$error":"#N/A"},{"$error":"#N/A"},null,null,null,null,null,null,null,"Product 5",{"$f":"((esempio!$M$19*(esempio!$M$21/100))*esempio!$M$22)","v":0},{"$f":"((esempio!$M$19*(esempio!$M$21/100))*(esempio!$M$22*(1+'prezzi combustibile'!$E$6)))","v":0},{"$f":"((esempio!$M$19*(esempio!$M$21/100))*(esempio!$M$22*(1+'prezzi combustibile'!$F$6)))","v":0},{"$f":"((esempio!$M$19*(esempio!$M$21/100))*(esempio!$M$22*(1+'prezzi combustibile'!$G$6)))","v":0},{"$f":"((esempio!$M$19*(esempio!$M$21/100))*(esempio!$M$22*(1+'prezzi combustibile'!$H$6)))","v":0},{"$f":"((esempio!$M$19*(esempio!$M$21/100))*(esempio!$M$22*(1+'prezzi combustibile'!$I$6)))","v":0},{"$f":"((esempio!$M$19*(esempio!$M$21/100))*(esempio!$M$22*(1+'prezzi combustibile'!$J$6)))","v":0},{"$f":"((esempio!$M$19*(esempio!$M$21/100))*(esempio!$M$22*(1+'prezzi combustibile'!$K$6)))","v":0},{"$f":"((esempio!$M$19*(esempio!$M$21/100))*(esempio!$M$22*(1+'prezzi combustibile'!$L$6)))","v":0},{"$f":"((esempio!$M$19*(esempio!$M$21/100))*(esempio!$M$22*(1+'prezzi combustibile'!$M$6)))","v":0},{"$f":"((esempio!$M$19*(esempio!$M$21/100))*(esempio!$M$22*(1+'prezzi combustibile'!$N$6)))","v":0},{"$f":"SUM(Q22:INDEX(Q22:AA22,esempio!$M$6))","v":0},null,"Product 5",{"$f":"((esempio!$M$19*(esempio!$M$25/100))*esempio!$M$26)","v":0},{"$f":"((esempio!$M$19*(esempio!$M$25/100))*(esempio!$M$26*(1+'prezzi combustibile'!$E$6)))","v":0},{"$f":"((esempio!$M$19*(esempio!$M$25/100))*(esempio!$M$26*(1+'prezzi combustibile'!$F$6)))","v":0},{"$f":"((esempio!$M$19*(esempio!$M$25/100))*(esempio!$M$26*(1+'prezzi combustibile'!$G$6)))","v":0},{"$f":"((esempio!$M$19*(esempio!$M$25/100))*(esempio!$M$26*(1+'prezzi combustibile'!$H$6)))","v":0},{"$f":"((esempio!$M$19*(esempio!$M$25/100))*(esempio!$M$26*(1+'prezzi combustibile'!$I$6)))","v":0},{"$f":"((esempio!$M$19*(esempio!$M$25/100))*(esempio!$M$26*(1+'prezzi combustibile'!$J$6)))","v":0},{"$f":"((esempio!$M$19*(esempio!$M$25/100))*(esempio!$M$26*(1+$K$6)))","v":0},{"$f":"((esempio!$M$19*(esempio!$M$25/100))*(esempio!$M$26*(1+$L$6)))","v":0},{"$f":"((esempio!$M$19*(esempio!$M$25/100))*(esempio!$M$26*(1+$M$6)))","v":0},{"$f":"((esempio!$M$19*(esempio!$M$25/100))*(esempio!$M$26*(1+$N$6)))","v":0},{"$f":"SUM(AE22:INDEX(AE22:AO22,esempio!$E$6))","v":0}]
[]
[null,"carburante 1",null,null,null,null,"costo totale per il carburante per il periodo specificato",null,null,null,null,null,null,null,null,"ETHANOL",2014,2015,2016,2017,2018,2019,2020,2021,2022,2023,2024,"Total fuel price for period",null,"Ethanol"]
[null,"tipo carburante","contenuto energetico","unità di misura","unità di misura consumo combustibile","unità di misura costo","prodotto 1","prodotto 2","prodotto 3","prodotto 4","prodotto 5",null,null,null,null,"Product 1",{"$f":"((esempio!$E$19*(esempio!$E$21/100))*esempio!$E$22)","v":40894.400000000001},{"$f":"((esempio!$E$19*(esempio!$E$21/100))*(esempio!$E$22*(1+'prezzi combustibile'!$E$6)))","v":39348.945563063855},{"$f":"((esempio!$E$19*(esempio!$E$21/100))*(esempio!$E$22*(1+'prezzi combustibile'!$F$6)))","v":38784.603092298101},{"$f":"((esempio!$E$19*(esempio!$E$21/100))*(esempio!$E$22*(1+'prezzi combustibile'!$G$6)))","v":38807.032151845939},{"$f":"((esempio!$E$19*(esempio!$E$21/100))*(esempio!$E$22*(1+'prezzi combustibile'!$H$6)))","v":39236.517252013509},{"$f":"((esempio!$E$19*(esempio!$E$21/100))*(esempio!$E$22*(1+'prezzi combustibile'!$I$6)))","v":40124.655521807399},{"$f":"((esempio!$E$19*(esempio!$E$21/100))*(esempio!$E$22*(1+'prezzi combustibile'!$J$6)))","v":40818.484510988194},{"$f":"((esempio!$E$19*(esempio!$E$21/100))*(esempio!$E$22*(1+'prezzi combustibile'!$K$6)))","v":41585.02445823585},{"$f":"((esempio!$E$19*(esempio!$E$21/100))*(esempio!$E$22*(1+'prezzi combustibile'!$L$6)))","v":42405.645090833677},{"$f":"((esempio!$E$19*(esempio!$E$21/100))*(esempio!$E$22*(1+'prezzi combustibile'!$M$6)))","v":42965.491178670309},{"$f":"((esempio!$E$19*(esempio!$E$21/100))*(esempio!$E$22*(1+'prezzi combustibile'!$N$6)))","v":43494.950470232572},{"$f":"SUM(Q25:INDEX(Q25:AA25,esempio!$E$6))","v":404970.79881975683},null,"Product 1",{"$f":"((esempio!$E$19*(esempio!$E$25/100))*esempio!$E$26)","v":0},{"$f":"((esempio!$E$19*(esempio!$E$25/100))*(esempio!$E$26*(1+'prezzi combustibile'!$E$6)))","v":0},{"$f":"((esempio!$E$19*(esempio!$E$25/100))*(esempio!$E$26*(1+'prezzi combustibile'!$F$6)))","v":0},{"$f":"((esempio!$E$19*(esempio!$E$25/100))*(esempio!$E$26*(1+'prezzi combustibile'!$G$6)))","v":0},{"$f":"((esempio!$E$19*(esempio!$E$25/100))*(esempio!$E$26*(1+'prezzi combustibile'!$H$6)))","v":0},{"$f":"((esempio!$E$19*(esempio!$E$25/100))*(esempio!$E$26*(1+'prezzi combustibile'!$I$6)))","v":0},{"$f":"((esempio!$E$19*(esempio!$E$25/100))*(esempio!$E$26*(1+'prezzi combustibile'!$J$6)))","v":0},{"$f":"((esempio!$E$19*(esempio!$E$25/100))*(esempio!$E$26*(1+$K$6)))","v":0},{"$f":"((esempio!$E$19*(esempio!$E$25/100))*(esempio!$E$26*(1+$L$6)))","v":0},{"$f":"((esempio!$E$19*(esempio!$E$25/100))*(esempio!$E$26*(1+$M$6)))","v":0},{"$f":"((esempio!$E$19*(esempio!$E$25/100))*(esempio!$E$26*(1+$N$6)))","v":0},{"$f":"SUM(AE25:INDEX(AE25:AO25,esempio!$E$6))","v":0}]
[null,"Diesel",36,"MJ/l","l/100km","€/l",{"$f":"$AB$4","v":404970.79881975683},{"$f":"$AB$5","v":315084.67879532394},{"$f":"$AB$6","v":356502.32690811565},{"$f":"$AB$7","v":0},{"$f":"$AB$8","v":0},null,null,null,null,"Product 2",{"$f":"((esempio!$G$19*(esempio!$G$21/100))*esempio!$G$22)","v":31817.599999999999},{"$f":"((esempio!$G$19*(esempio!$G$21/100))*(esempio!$G$22*(1+'prezzi combustibile'!$E$6)))","v":30615.170056226292},{"$f":"((esempio!$G$19*(esempio!$G$21/100))*(esempio!$G$22*(1+'prezzi combustibile'!$F$6)))","v":30176.087370141242},{"$f":"((esempio!$G$19*(esempio!$G$21/100))*(esempio!$G$22*(1+'prezzi combustibile'!$G$6)))","v":30193.538142009013},{"$f":"((esempio!$G$19*(esempio!$G$21/100))*(esempio!$G$22*(1+'prezzi combustibile'!$H$6)))","v":30527.696000373278},{"$f":"((esempio!$G$19*(esempio!$G$21/100))*(esempio!$G$22*(1+'prezzi combustibile'!$I$6)))","v":31218.705728184275},{"$f":"((esempio!$G$19*(esempio!$G$21/100))*(esempio!$G$22*(1+'prezzi combustibile'!$J$6)))","v":31758.534488262892},{"$f":"((esempio!$G$19*(esempio!$G$21/100))*(esempio!$G$22*(1+'prezzi combustibile'!$K$6)))","v":32354.935497338633},{"$f":"((esempio!$G$19*(esempio!$G$21/100))*(esempio!$G$22*(1+'prezzi combustibile'!$L$6)))","v":32993.413602892077},{"$f":"((esempio!$G$19*(esempio!$G$21/100))*(esempio!$G$22*(1+'prezzi combustibile'!$M$6)))","v":33428.997909896229},{"$f":"((esempio!$G$19*(esempio!$G$21/100))*(esempio!$G$22*(1+'prezzi combustibile'!$N$6)))","v":33840.939983999568},{"$f":"SUM(Q26:INDEX(Q26:AA26,esempio!$G$6))","v":315084.67879532394},null,"Product 2",{"$f":"((esempio!$G$19*(esempio!$G$25/100))*esempio!$G$26)","v":200000},{"$f":"((esempio!$G$19*(esempio!$G$25/100))*(esempio!$G$26*(1+'prezzi combustibile'!$E$6)))","v":192441.73071649836},{"$f":"((esempio!$G$19*(esempio!$G$25/100))*(esempio!$G$26*(1+'prezzi combustibile'!$F$6)))","v":189681.73193541463},{"$f":"((esempio!$G$19*(esempio!$G$25/100))*(esempio!$G$26*(1+'prezzi combustibile'!$G$6)))","v":189791.42450724763},{"$f":"((esempio!$G$19*(esempio!$G$25/100))*(esempio!$G$26*(1+'prezzi combustibile'!$H$6)))","v":191891.88373964897},{"$f":"((esempio!$G$19*(esempio!$G$25/100))*(esempio!$G$26*(1+'prezzi combustibile'!$I$6)))","v":196235.45288258244},{"$f":"((esempio!$G$19*(esempio!$G$25/100))*(esempio!$G$26*(1+'prezzi combustibile'!$J$6)))","v":199628.72428003929},{"$f":"((esempio!$G$19*(esempio!$G$25/100))*(esempio!$G$26*(1+$K$6)))","v":200000},{"$f":"((esempio!$G$19*(esempio!$G$25/100))*(esempio!$G$26*(1+$L$6)))","v":200000},{"$f":"((esempio!$G$19*(esempio!$G$25/100))*(esempio!$G$26*(1+$M$6)))","v":200000},{"$f":"((esempio!$G$19*(esempio!$G$25/100))*(esempio!$G$26*(1+$N$6)))","v":200000},{"$f":"SUM(AE26:INDEX(AE26:AO26,esempio!$E$6))","v":1959670.9480614313}]
[null,"benzina",32,"MJ/l","l/100km","€/l",{"$f":"$AB$11","v":404970.79881975683},{"$f":"$AB$12","v":315084.67879532394},{"$f":"$AB$13","v":356502.32690811565},{"$f":"$AB$14","v":0},{"$f":"$AB$15","v":0},null,null,null,null,"Product 3",{"$f":"((esempio!$I$19*(esempio!$I$21/100))*esempio!$I$22)","v":36000},{"$f":"((esempio!$I$19*(esempio!$I$21/100))*(esempio!$I$22*(1+'prezzi combustibile'!$E$6)))","v":34639.511528969706},{"$f":"((esempio!$I$19*(esempio!$I$21/100))*(esempio!$I$22*(1+'prezzi combustibile'!$F$6)))","v":34142.711748374633},{"$f":"((esempio!$I$19*(esempio!$I$21/100))*(esempio!$I$22*(1+'prezzi combustibile'!$G$6)))","v":34162.456411304578},{"$f":"((esempio!$I$19*(esempio!$I$21/100))*(esempio!$I$22*(1+'prezzi combustibile'!$H$6)))","v":34540.539073136817},{"$f":"((esempio!$I$19*(esempio!$I$21/100))*(esempio!$I$22*(1+'prezzi combustibile'!$I$6)))","v":35322.381518864837},{"$f":"((esempio!$I$19*(esempio!$I$21/100))*(esempio!$I$22*(1+'prezzi combustibile'!$J$6)))","v":35933.170370407068},{"$f":"((esempio!$I$19*(esempio!$I$21/100))*(esempio!$I$22*(1+'prezzi combustibile'!$K$6)))","v":36607.96785125813},{"$f":"((esempio!$I$19*(esempio!$I$21/100))*(esempio!$I$22*(1+'prezzi combustibile'!$L$6)))","v":37330.373431814936},{"$f":"((esempio!$I$19*(esempio!$I$21/100))*(esempio!$I$22*(1+'prezzi combustibile'!$M$6)))","v":37823.21497398497},{"$f":"((esempio!$I$19*(esempio!$I$21/100))*(esempio!$I$22*(1+'prezzi combustibile'!$N$6)))","v":38289.306529216054},{"$f":"SUM(Q27:INDEX(Q27:AA27,esempio!$I$6))","v":356502.32690811565},null,"Product 3",{"$f":"((esempio!$I$19*(esempio!$I$25/100))*esempio!$I$26)","v":0},{"$f":"((esempio!$I$19*(esempio!$I$25/100))*(esempio!$I$26*(1+'prezzi combustibile'!$E$6)))","v":0},{"$f":"((esempio!$I$19*(esempio!$I$25/100))*(esempio!$I$26*(1+'prezzi combustibile'!$F$6)))","v":0},{"$f":"((esempio!$I$19*(esempio!$I$25/100))*(esempio!$I$26*(1+'prezzi combustibile'!$G$6)))","v":0},{"$f":"((esempio!$I$19*(esempio!$I$25/100))*(esempio!$I$26*(1+'prezzi combustibile'!$H$6)))","v":0},{"$f":"((esempio!$I$19*(esempio!$I$25/100))*(esempio!$I$26*(1+'prezzi combustibile'!$I$6)))","v":0},{"$f":"((esempio!$I$19*(esempio!$I$25/100))*(esempio!$I$26*(1+'prezzi combustibile'!$J$6)))","v":0},{"$f":"((esempio!$I$19*(esempio!$I$25/100))*(esempio!$I$26*(1+$K$6)))","v":0},{"$f":"((esempio!$I$19*(esempio!$I$25/100))*(esempio!$I$26*(1+$L$6)))","v":0},{"$f":"((esempio!$I$19*(esempio!$I$25/100))*(esempio!$I$26*(1+$M$6)))","v":0},{"$f":"((esempio!$I$19*(esempio!$I$25/100))*(esempio!$I$26*(1+$N$6)))","v":0},{"$f":"SUM(AE27:INDEX(AE27:AO27,esempio!$E$6))","v":0}]
[null,"Biogas/CBG",35,"MJ/Nm3","Nm3/100km","€/Nm3",null,null,null,null,null,null,null,null,null,"Product 4",{"$f":"((esempio!$K$19*(esempio!$K$21/100))*esempio!$K$22)","v":0},{"$f":"((esempio!$K$19*(esempio!$K$21/100))*(esempio!$K$22*(1+'prezzi combustibile'!$E$6)))","v":0},{"$f":"((esempio!$K$19*(esempio!$K$21/100))*(esempio!$K$22*(1+'prezzi combustibile'!$F$6)))","v":0},{"$f":"((esempio!$K$19*(esempio!$K$21/100))*(esempio!$K$22*(1+'prezzi combustibile'!$G$6)))","v":0},{"$f":"((esempio!$K$19*(esempio!$K$21/100))*(esempio!$K$22*(1+'prezzi combustibile'!$H$6)))","v":0},{"$f":"((esempio!$K$19*(esempio!$K$21/100))*(esempio!$K$22*(1+'prezzi combustibile'!$I$6)))","v":0},{"$f":"((esempio!$K$19*(esempio!$K$21/100))*(esempio!$K$22*(1+'prezzi combustibile'!$J$6)))","v":0},{"$f":"((esempio!$K$19*(esempio!$K$21/100))*(esempio!$K$22*(1+'prezzi combustibile'!$K$6)))","v":0},{"$f":"((esempio!$K$19*(esempio!$K$21/100))*(esempio!$K$22*(1+'prezzi combustibile'!$L$6)))","v":0},{"$f":"((esempio!$K$19*(esempio!$K$21/100))*(esempio!$K$22*(1+'prezzi combustibile'!$M$6)))","v":0},{"$f":"((esempio!$K$19*(esempio!$K$21/100))*(esempio!$K$22*(1+'prezzi combustibile'!$N$6)))","v":0},{"$f":"SUM(Q28:INDEX(Q28:AA28,esempio!$K$6))","v":0},null,"Product 4",{"$f":"((esempio!$K$19*(esempio!$K$25/100))*esempio!$K$26)","v":0},{"$f":"((esempio!$K$19*(esempio!$K$25/100))*(esempio!$K$26*(1+'prezzi combustibile'!$E$6)))","v":0},{"$f":"((esempio!$K$19*(esempio!$K$25/100))*(esempio!$K$26*(1+'prezzi combustibile'!$F$6)))","v":0},{"$f":"((esempio!$K$19*(esempio!$K$25/100))*(esempio!$K$26*(1+'prezzi combustibile'!$G$6)))","v":0},{"$f":"((esempio!$K$19*(esempio!$K$25/100))*(esempio!$K$26*(1+'prezzi combustibile'!$H$6)))","v":0},{"$f":"((esempio!$K$19*(esempio!$K$25/100))*(esempio!$K$26*(1+'prezzi combustibile'!$I$6)))","v":0},{"$f":"((esempio!$K$19*(esempio!$K$25/100))*(esempio!$K$26*(1+'prezzi combustibile'!$J$6)))","v":0},{"$f":"((esempio!$K$19*(esempio!$K$25/100))*(esempio!$K$26*(1+$K$6)))","v":0},{"$f":"((esempio!$K$19*(esempio!$K$25/100))*(esempio!$K$26*(1+$L$6)))","v":0},{"$f":"((esempio!$K$19*(esempio!$K$25/100))*(esempio!$K$26*(1+$M$6)))","v":0},{"$f":"((esempio!$K$19*(esempio!$K$25/100))*(esempio!$K$26*(1+$N$6)))","v":0},{"$f":"SUM(AE28:INDEX(AE28:AO28,esempio!$E$6))","v":0}]
[null,"Natural Gas/CNG (Nm3/100km)",35,"MJ/Nm3","Nm3/100km","€/Nm3",{"$f":"$AB$46","v":404970.79881975683},{"$f":"$AB$47","v":315084.67879532394},{"$f":"$AB$48","v":356502.32690811565},{"$f":"$AB$49","v":0},{"$f":"$AB$50","v":0},null,null,null,null,"Product 5",{"$f":"((esempio!$M$19*(esempio!$M$21/100))*esempio!$M$22)","v":0},{"$f":"((esempio!$M$19*(esempio!$M$21/100))*(esempio!$M$22*(1+'prezzi combustibile'!$E$6)))","v":0},{"$f":"((esempio!$M$19*(esempio!$M$21/100))*(esempio!$M$22*(1+'prezzi combustibile'!$F$6)))","v":0},{"$f":"((esempio!$M$19*(esempio!$M$21/100))*(esempio!$M$22*(1+'prezzi combustibile'!$G$6)))","v":0},{"$f":"((esempio!$M$19*(esempio!$M$21/100))*(esempio!$M$22*(1+'prezzi combustibile'!$H$6)))","v":0},{"$f":"((esempio!$M$19*(esempio!$M$21/100))*(esempio!$M$22*(1+'prezzi combustibile'!$I$6)))","v":0},{"$f":"((esempio!$M$19*(esempio!$M$21/100))*(esempio!$M$22*(1+'prezzi combustibile'!$J$6)))","v":0},{"$f":"((esempio!$M$19*(esempio!$M$21/100))*(esempio!$M$22*(1+'prezzi combustibile'!$K$6)))","v":0},{"$f":"((esempio!$M$19*(esempio!$M$21/100))*(esempio!$M$22*(1+'prezzi combustibile'!$L$6)))","v":0},{"$f":"((esempio!$M$19*(esempio!$M$21/100))*(esempio!$M$22*(1+'prezzi combustibile'!$M$6)))","v":0},{"$f":"((esempio!$M$19*(esempio!$M$21/100))*(esempio!$M$22*(1+'prezzi combustibile'!$N$6)))","v":0},{"$f":"SUM(Q29:INDEX(Q29:AA29,esempio!$M$6))","v":0},null,"Product 5",{"$f":"((esempio!$M$19*(esempio!$M$25/100))*esempio!$M$26)","v":0},{"$f":"((esempio!$M$19*(esempio!$M$25/100))*(esempio!$M$26*(1+'prezzi combustibile'!$E$6)))","v":0},{"$f":"((esempio!$M$19*(esempio!$M$25/100))*(esempio!$M$26*(1+'prezzi combustibile'!$F$6)))","v":0},{"$f":"((esempio!$M$19*(esempio!$M$25/100))*(esempio!$M$26*(1+'prezzi combustibile'!$G$6)))","v":0},{"$f":"((esempio!$M$19*(esempio!$M$25/100))*(esempio!$M$26*(1+'prezzi combustibile'!$H$6)))","v":0},{"$f":"((esempio!$M$19*(esempio!$M$25/100))*(esempio!$M$26*(1+'prezzi combustibile'!$I$6)))","v":0},{"$f":"((esempio!$M$19*(esempio!$M$25/100))*(esempio!$M$26*(1+'prezzi combustibile'!$J$6)))","v":0},{"$f":"((esempio!$M$19*(esempio!$M$25/100))*(esempio!$M$26*(1+$K$6)))","v":0},{"$f":"((esempio!$M$19*(esempio!$M$25/100))*(esempio!$M$26*(1+$L$6)))","v":0},{"$f":"((esempio!$M$19*(esempio!$M$25/100))*(esempio!$M$26*(1+$M$6)))","v":0},{"$f":"((esempio!$M$19*(esempio!$M$25/100))*(esempio!$M$26*(1+$N$6)))","v":0},{"$f":"SUM(AE29:INDEX(AE29:AO29,esempio!$E$6))","v":0}]
[null,"Natural Gas/CNG (kg/100km)",null,"MJ/kg","kg/100km","€/kg",{"$f":"$AB$46","v":404970.79881975683},{"$f":"$AB$47","v":315084.67879532394},{"$f":"$AB$48","v":356502.32690811565},{"$f":"$AB$49","v":0},{"$f":"$AB$50","v":0}]
[null,"elettricità",3.6,"MJ/kWh","kWh/100km","€/kWh",{"$f":"$AB$32","v":404970.79881975683},{"$f":"$AB$33","v":315084.67879532394},{"$f":"$AB$34","v":356502.32690811565},{"$f":"$AB$35","v":0},{"$f":"$AB$36","v":0},null,null,null,null,"ELECTRICITY",2014,2015,2016,2017,2018,2019,2020,2021,2022,2023,2024,"Total fuel price for period",null,"ELECTRICITY",2014,2015,2016,2017,2018,2019,2020,2021,2022,2023,2024,"Total fuel price for period"]
[null,"biodiesel",33,"MJ/l","l/100km","€/l",{"$f":"$AB$39","v":404970.79881975683},{"$f":"$AB$40","v":315084.67879532394},{"$f":"$AB$41","v":356502.32690811565},{"$f":"$AB$42","v":0},{"$f":"$AB$43","v":0},null,null,null,null,"Product 1",{"$f":"((esempio!$E$19*(esempio!$E$21/100))*esempio!$E$22)","v":40894.400000000001},{"$f":"((esempio!$E$19*(esempio!$E$21/100))*(esempio!$E$22*(1+'prezzi combustibile'!$E$6)))","v":39348.945563063855},{"$f":"((esempio!$E$19*(esempio!$E$21/100))*(esempio!$E$22*(1+'prezzi combustibile'!$F$6)))","v":38784.603092298101},{"$f":"((esempio!$E$19*(esempio!$E$21/100))*(esempio!$E$22*(1+'prezzi combustibile'!$G$6)))","v":38807.032151845939},{"$f":"((esempio!$E$19*(esempio!$E$21/100))*(esempio!$E$22*(1+'prezzi combustibile'!$H$6)))","v":39236.517252013509},{"$f":"((esempio!$E$19*(esempio!$E$21/100))*(esempio!$E$22*(1+'prezzi combustibile'!$I$6)))","v":40124.655521807399},{"$f":"((esempio!$E$19*(esempio!$E$21/100))*(esempio!$E$22*(1+'prezzi combustibile'!$J$6)))","v":40818.484510988194},{"$f":"((esempio!$E$19*(esempio!$E$21/100))*(esempio!$E$22*(1+'prezzi combustibile'!$K$6)))","v":41585.02445823585},{"$f":"((esempio!$E$19*(esempio!$E$21/100))*(esempio!$E$22*(1+'prezzi combustibile'!$L$6)))","v":42405.645090833677},{"$f":"((esempio!$E$19*(esempio!$E$21/100))*(esempio!$E$22*(1+'prezzi combustibile'!$M$6)))","v":42965.491178670309},{"$f":"((esempio!$E$19*(esempio!$E$21/100))*(esempio!$E$22*(1+'prezzi combustibile'!$N$6)))","v":43494.950470232572},{"$f":"SUM(Q32:INDEX(Q32:AA32,esempio!$E$6))","v":404970.79881975683},null,"Product 1",{"$f":"((esempio!$E$19*(esempio!$E$25/100))*esempio!$E$26)","v":0},{"$f":"((esempio!$E$19*(esempio!$E$25/100))*(esempio!$E$26*(1+'prezzi combustibile'!$E$6)))","v":0},{"$f":"((esempio!$E$19*(esempio!$E$25/100))*(esempio!$E$26*(1+'prezzi combustibile'!$F$6)))","v":0},{"$f":"((esempio!$E$19*(esempio!$E$25/100))*(esempio!$E$26*(1+'prezzi combustibile'!$G$6)))","v":0},{"$f":"((esempio!$E$19*(esempio!$E$25/100))*(esempio!$E$26*(1+'prezzi combustibile'!$H$6)))","v":0},{"$f":"((esempio!$E$19*(esempio!$E$25/100))*(esempio!$E$26*(1+'prezzi combustibile'!$I$6)))","v":0},{"$f":"((esempio!$E$19*(esempio!$E$25/100))*(esempio!$E$26*(1+'prezzi combustibile'!$J$6)))","v":0},{"$f":"((esempio!$E$19*(esempio!$E$25/100))*(esempio!$E$26*(1+$K$6)))","v":0},{"$f":"((esempio!$E$19*(esempio!$E$25/100))*(esempio!$E$26*(1+$L$6)))","v":0},{"$f":"((esempio!$E$19*(esempio!$E$25/100))*(esempio!$E$26*(1+$M$6)))","v":0},{"$f":"((esempio!$E$19*(esempio!$E$25/100))*(esempio!$E$26*(1+$N$6)))","v":0},{"$f":"SUM(AE32:INDEX(AE32:AO32,esempio!$E$6))","v":0}]
[null,"LPG",24,"MJ/l","l/100km","€/l",{"$f":"$AB$18","v":404970.79881975683},{"$f":"$AB$19","v":315084.67879532394},{"$f":"$AB$20","v":356502.32690811565},{"$f":"$AB$21","v":0},{"$f":"$AB$22","v":0},null,null,null,null,"Product 2",{"$f":"((esempio!$G$19*(esempio!$G$21/100))*esempio!$G$22)","v":31817.599999999999},{"$f":"((esempio!$G$19*(esempio!$G$21/100))*(esempio!$G$22*(1+'prezzi combustibile'!$E$6)))","v":30615.170056226292},{"$f":"((esempio!$G$19*(esempio!$G$21/100))*(esempio!$G$22*(1+'prezzi combustibile'!$F$6)))","v":30176.087370141242},{"$f":"((esempio!$G$19*(esempio!$G$21/100))*(esempio!$G$22*(1+'prezzi combustibile'!$G$6)))","v":30193.538142009013},{"$f":"((esempio!$G$19*(esempio!$G$21/100))*(esempio!$G$22*(1+'prezzi combustibile'!$H$6)))","v":30527.696000373278},{"$f":"((esempio!$G$19*(esempio!$G$21/100))*(esempio!$G$22*(1+'prezzi combustibile'!$I$6)))","v":31218.705728184275},{"$f":"((esempio!$G$19*(esempio!$G$21/100))*(esempio!$G$22*(1+'prezzi combustibile'!$J$6)))","v":31758.534488262892},{"$f":"((esempio!$G$19*(esempio!$G$21/100))*(esempio!$G$22*(1+'prezzi combustibile'!$K$6)))","v":32354.935497338633},{"$f":"((esempio!$G$19*(esempio!$G$21/100))*(esempio!$G$22*(1+'prezzi combustibile'!$L$6)))","v":32993.413602892077},{"$f":"((esempio!$G$19*(esempio!$G$21/100))*(esempio!$G$22*(1+'prezzi combustibile'!$M$6)))","v":33428.997909896229},{"$f":"((esempio!$G$19*(esempio!$G$21/100))*(esempio!$G$22*(1+'prezzi combustibile'!$N$6)))","v":33840.939983999568},{"$f":"SUM(Q33:INDEX(Q33:AA33,esempio!$G$6))","v":315084.67879532394},null,"Product 2",{"$f":"((esempio!$G$19*(esempio!$G$25/100))*esempio!$G$26)","v":200000},{"$f":"((esempio!$G$19*(esempio!$G$25/100))*(esempio!$G$26*(1+'prezzi combustibile'!$E$6)))","v":192441.73071649836},{"$f":"((esempio!$G$19*(esempio!$G$25/100))*(esempio!$G$26*(1+'prezzi combustibile'!$F$6)))","v":189681.73193541463},{"$f":"((esempio!$G$19*(esempio!$G$25/100))*(esempio!$G$26*(1+'prezzi combustibile'!$G$6)))","v":189791.42450724763},{"$f":"((esempio!$G$19*(esempio!$G$25/100))*(esempio!$G$26*(1+'prezzi combustibile'!$H$6)))","v":191891.88373964897},{"$f":"((esempio!$G$19*(esempio!$G$25/100))*(esempio!$G$26*(1+'prezzi combustibile'!$I$6)))","v":196235.45288258244},{"$f":"((esempio!$G$19*(esempio!$G$25/100))*(esempio!$G$26*(1+'prezzi combustibile'!$J$6)))","v":199628.72428003929},{"$f":"((esempio!$G$19*(esempio!$G$25/100))*(esempio!$G$26*(1+$K$6)))","v":200000},{"$f":"((esempio!$G$19*(esempio!$G$25/100))*(esempio!$G$26*(1+$L$6)))","v":200000},{"$f":"((esempio!$G$19*(esempio!$G$25/100))*(esempio!$G$26*(1+$M$6)))","v":200000},{"$f":"((esempio!$G$19*(esempio!$G$25/100))*(esempio!$G$26*(1+$N$6)))","v":200000},{"$f":"SUM(AE33:INDEX(AE33:AO33,esempio!$E$6))","v":1959670.9480614313}]
[null,"etanolo",21,"MJ/l","l/100km","€/l",{"$f":"$AB$25","v":404970.79881975683},{"$f":"$AB$26","v":315084.67879532394},{"$f":"$AB$27","v":356502.32690811565},{"$f":"$AB$28","v":0},{"$f":"$AB$29","v":0},null,null,null,null,"Product 3",{"$f":"((esempio!$I$19*(esempio!$I$21/100))*esempio!$I$22)","v":36000},{"$f":"((esempio!$I$19*(esempio!$I$21/100))*(esempio!$I$22*(1+'prezzi combustibile'!$E$6)))","v":34639.511528969706},{"$f":"((esempio!$I$19*(esempio!$I$21/100))*(esempio!$I$22*(1+'prezzi combustibile'!$F$6)))","v":34142.711748374633},{"$f":"((esempio!$I$19*(esempio!$I$21/100))*(esempio!$I$22*(1+'prezzi combustibile'!$G$6)))","v":34162.456411304578},{"$f":"((esempio!$I$19*(esempio!$I$21/100))*(esempio!$I$22*(1+'prezzi combustibile'!$H$6)))","v":34540.539073136817},{"$f":"((esempio!$I$19*(esempio!$I$21/100))*(esempio!$I$22*(1+'prezzi combustibile'!$I$6)))","v":35322.381518864837},{"$f":"((esempio!$I$19*(esempio!$I$21/100))*(esempio!$I$22*(1+'prezzi combustibile'!$J$6)))","v":35933.170370407068},{"$f":"((esempio!$I$19*(esempio!$I$21/100))*(esempio!$I$22*(1+'prezzi combustibile'!$K$6)))","v":36607.96785125813},{"$f":"((esempio!$I$19*(esempio!$I$21/100))*(esempio!$I$22*(1+'prezzi combustibile'!$L$6)))","v":37330.373431814936},{"$f":"((esempio!$I$19*(esempio!$I$21/100))*(esempio!$I$22*(1+'prezzi combustibile'!$M$6)))","v":37823.21497398497},{"$f":"((esempio!$I$19*(esempio!$I$21/100))*(esempio!$I$22*(1+'prezzi combustibile'!$N$6)))","v":38289.306529216054},{"$f":"SUM(Q34:INDEX(Q34:AA34,esempio!$I$6))","v":356502.32690811565},null,"Product 3",{"$f":"((esempio!$I$19*(esempio!$I$25/100))*esempio!$I$26)","v":0},{"$f":"((esempio!$I$19*(esempio!$I$25/100))*(esempio!$I$26*(1+'prezzi combustibile'!$E$6)))","v":0},{"$f":"((esempio!$I$19*(esempio!$I$25/100))*(esempio!$I$26*(1+'prezzi combustibile'!$F$6)))","v":0},{"$f":"((esempio!$I$19*(esempio!$I$25/100))*(esempio!$I$26*(1+'prezzi combustibile'!$G$6)))","v":0},{"$f":"((esempio!$I$19*(esempio!$I$25/100))*(esempio!$I$26*(1+'prezzi combustibile'!$H$6)))","v":0},{"$f":"((esempio!$I$19*(esempio!$I$25/100))*(esempio!$I$26*(1+'prezzi combustibile'!$I$6)))","v":0},{"$f":"((esempio!$I$19*(esempio!$I$25/100))*(esempio!$I$26*(1+'prezzi combustibile'!$J$6)))","v":0},{"$f":"((esempio!$I$19*(esempio!$I$25/100))*(esempio!$I$26*(1+$K$6)))","v":0},{"$f":"((esempio!$I$19*(esempio!$I$25/100))*(esempio!$I$26*(1+$L$6)))","v":0},{"$f":"((esempio!$I$19*(esempio!$I$25/100))*(esempio!$I$26*(1+$M$6)))","v":0},{"$f":"((esempio!$I$19*(esempio!$I$25/100))*(esempio!$I$26*(1+$N$6)))","v":0},{"$f":"SUM(AE34:INDEX(AE34:AO34,esempio!$E$6))","v":0}]
[null,"idrogeno gas",11,"MJ/Nm3","Nm3/100km","€/Nm3",null,null,null,null,null,null,null,null,null,"Product 4",{"$f":"((esempio!$K$19*(esempio!$K$21/100))*esempio!$K$22)","v":0},{"$f":"((esempio!$K$19*(esempio!$K$21/100))*(esempio!$K$22*(1+'prezzi combustibile'!$E$6)))","v":0},{"$f":"((esempio!$K$19*(esempio!$K$21/100))*(esempio!$K$22*(1+'prezzi combustibile'!$F$6)))","v":0},{"$f":"((esempio!$K$19*(esempio!$K$21/100))*(esempio!$K$22*(1+'prezzi combustibile'!$G$6)))","v":0},{"$f":"((esempio!$K$19*(esempio!$K$21/100))*(esempio!$K$22*(1+'prezzi combustibile'!$H$6)))","v":0},{"$f":"((esempio!$K$19*(esempio!$K$21/100))*(esempio!$K$22*(1+'prezzi combustibile'!$I$6)))","v":0},{"$f":"((esempio!$K$19*(esempio!$K$21/100))*(esempio!$K$22*(1+'prezzi combustibile'!$J$6)))","v":0},{"$f":"((esempio!$K$19*(esempio!$K$21/100))*(esempio!$K$22*(1+'prezzi combustibile'!$K$6)))","v":0},{"$f":"((esempio!$K$19*(esempio!$K$21/100))*(esempio!$K$22*(1+'prezzi combustibile'!$L$6)))","v":0},{"$f":"((esempio!$K$19*(esempio!$K$21/100))*(esempio!$K$22*(1+'prezzi combustibile'!$M$6)))","v":0},{"$f":"((esempio!$K$19*(esempio!$K$21/100))*(esempio!$K$22*(1+'prezzi combustibile'!$N$6)))","v":0},{"$f":"SUM(Q35:INDEX(Q35:AA35,esempio!$K$6))","v":0},null,"Product 4",{"$f":"((esempio!$K$19*(esempio!$K$25/100))*esempio!$K$26)","v":0},{"$f":"((esempio!$K$19*(esempio!$K$25/100))*(esempio!$K$26*(1+'prezzi combustibile'!$E$6)))","v":0},{"$f":"((esempio!$K$19*(esempio!$K$25/100))*(esempio!$K$26*(1+'prezzi combustibile'!$F$6)))","v":0},{"$f":"((esempio!$K$19*(esempio!$K$25/100))*(esempio!$K$26*(1+'prezzi combustibile'!$G$6)))","v":0},{"$f":"((esempio!$K$19*(esempio!$K$25/100))*(esempio!$K$26*(1+'prezzi combustibile'!$H$6)))","v":0},{"$f":"((esempio!$K$19*(esempio!$K$25/100))*(esempio!$K$26*(1+'prezzi combustibile'!$I$6)))","v":0},{"$f":"((esempio!$K$19*(esempio!$K$25/100))*(esempio!$K$26*(1+'prezzi combustibile'!$J$6)))","v":0},{"$f":"((esempio!$K$19*(esempio!$K$25/100))*(esempio!$K$26*(1+$K$6)))","v":0},{"$f":"((esempio!$K$19*(esempio!$K$25/100))*(esempio!$K$26*(1+$L$6)))","v":0},{"$f":"((esempio!$K$19*(esempio!$K$25/100))*(esempio!$K$26*(1+$M$6)))","v":0},{"$f":"((esempio!$K$19*(esempio!$K$25/100))*(esempio!$K$26*(1+$N$6)))","v":0},{"$f":"SUM(AE35:INDEX(AE35:AO35,esempio!$E$6))","v":0}]
[null,"idrogeno liquido - kg/100km",120,"MJ/kg","kg/100km","€/kg",null,null,null,null,null,null,null,null,null,"Product 5",{"$f":"((esempio!$M$19*(esempio!$M$21/100))*esempio!$M$22)","v":0},{"$f":"((esempio!$M$19*(esempio!$M$21/100))*(esempio!$M$22*(1+'prezzi combustibile'!$E$6)))","v":0},{"$f":"((esempio!$M$19*(esempio!$M$21/100))*(esempio!$M$22*(1+'prezzi combustibile'!$F$6)))","v":0},{"$f":"((esempio!$M$19*(esempio!$M$21/100))*(esempio!$M$22*(1+'prezzi combustibile'!$G$6)))","v":0},{"$f":"((esempio!$M$19*(esempio!$M$21/100))*(esempio!$M$22*(1+'prezzi combustibile'!$H$6)))","v":0},{"$f":"((esempio!$M$19*(esempio!$M$21/100))*(esempio!$M$22*(1+'prezzi combustibile'!$I$6)))","v":0},{"$f":"((esempio!$M$19*(esempio!$M$21/100))*(esempio!$M$22*(1+'prezzi combustibile'!$J$6)))","v":0},{"$f":"((esempio!$M$19*(esempio!$M$21/100))*(esempio!$M$22*(1+'prezzi combustibile'!$K$6)))","v":0},{"$f":"((esempio!$M$19*(esempio!$M$21/100))*(esempio!$M$22*(1+'prezzi combustibile'!$L$6)))","v":0},{"$f":"((esempio!$M$19*(esempio!$M$21/100))*(esempio!$M$22*(1+'prezzi combustibile'!$M$6)))","v":0},{"$f":"((esempio!$M$19*(esempio!$M$21/100))*(esempio!$M$22*(1+'prezzi combustibile'!$N$6)))","v":0},{"$f":"SUM(Q36:INDEX(Q36:AA36,esempio!$M$6))","v":0},null,"Product 5",{"$f":"((esempio!$M$19*(esempio!$M$25/100))*esempio!$M$26)","v":0},{"$f":"((esempio!$M$19*(esempio!$M$25/100))*(esempio!$M$26*(1+'prezzi combustibile'!$E$6)))","v":0},{"$f":"((esempio!$M$19*(esempio!$M$25/100))*(esempio!$M$26*(1+'prezzi combustibile'!$F$6)))","v":0},{"$f":"((esempio!$M$19*(esempio!$M$25/100))*(esempio!$M$26*(1+'prezzi combustibile'!$G$6)))","v":0},{"$f":"((esempio!$M$19*(esempio!$M$25/100))*(esempio!$M$26*(1+'prezzi combustibile'!$H$6)))","v":0},{"$f":"((esempio!$M$19*(esempio!$M$25/100))*(esempio!$M$26*(1+'prezzi combustibile'!$I$6)))","v":0},{"$f":"((esempio!$M$19*(esempio!$M$25/100))*(esempio!$M$26*(1+'prezzi combustibile'!$J$6)))","v":0},{"$f":"((esempio!$M$19*(esempio!$M$25/100))*(esempio!$M$26*(1+$K$6)))","v":0},{"$f":"((esempio!$M$19*(esempio!$M$25/100))*(esempio!$M$26*(1+$L$6)))","v":0},{"$f":"((esempio!$M$19*(esempio!$M$25/100))*(esempio!$M$26*(1+$M$6)))","v":0},{"$f":"((esempio!$M$19*(esempio!$M$25/100))*(esempio!$M$26*(1+$N$6)))","v":0},{"$f":"SUM(AE36:INDEX(AE36:AO36,esempio!$E$6))","v":0}]
[null,"idrogeno liquido - l/100km",8.6,"MJ/l","l/100km","€/l"]
[null,"Carburante emulsionato ",32,"MJ/l","l/100km","€/l",null,null,null,null,null,null,null,null,null,"BIODIESEL",2014,2015,2016,2017,2018,2019,2020,2021,2022,2023,2024,"Total fuel price for period",null,"BIODIESEL",2014,2015,2016,2017,2018,2019,2020,2021,2022,2023,2024,"Total fuel price for period"]
[null,null,null,null,null,null,null,null,null,null,null,null,null,null,null,"Product 1",{"$f":"((esempio!$E$19*(esempio!$E$21/100))*esempio!$E$22)","v":40894.400000000001},{"$f":"((esempio!$E$19*(esempio!$E$21/100))*(esempio!$E$22*(1+'prezzi combustibile'!$E$6)))","v":39348.945563063855},{"$f":"((esempio!$E$19*(esempio!$E$21/100))*(esempio!$E$22*(1+'prezzi combustibile'!$F$6)))","v":38784.603092298101},{"$f":"((esempio!$E$19*(esempio!$E$21/100))*(esempio!$E$22*(1+'prezzi combustibile'!$G$6)))","v":38807.032151845939},{"$f":"((esempio!$E$19*(esempio!$E$21/100))*(esempio!$E$22*(1+'prezzi combustibile'!$H$6)))","v":39236.517252013509},{"$f":"((esempio!$E$19*(esempio!$E$21/100))*(esempio!$E$22*(1+'prezzi combustibile'!$I$6)))","v":40124.655521807399},{"$f":"((esempio!$E$19*(esempio!$E$21/100))*(esempio!$E$22*(1+'prezzi combustibile'!$J$6)))","v":40818.484510988194},{"$f":"((esempio!$E$19*(esempio!$E$21/100))*(esempio!$E$22*(1+'prezzi combustibile'!$K$6)))","v":41585.02445823585},{"$f":"((esempio!$E$19*(esempio!$E$21/100))*(esempio!$E$22*(1+'prezzi combustibile'!$L$6)))","v":42405.645090833677},{"$f":"((esempio!$E$19*(esempio!$E$21/100))*(esempio!$E$22*(1+'prezzi combustibile'!$M$6)))","v":42965.491178670309},{"$f":"((esempio!$E$19*(esempio!$E$21/100))*(esempio!$E$22*(1+'prezzi combustibile'!$N$6)))","v":43494.950470232572},{"$f":"SUM(Q39:INDEX(Q39:AA39,esempio!$E$6))","v":404970.79881975683},null,"Product 1",{"$f":"((esempio!$E$19*(esempio!$E$25/100))*esempio!$E$26)","v":0},{"$f":"((esempio!$E$19*(esempio!$E$25/100))*(esempio!$E$26*(1+'prezzi combustibile'!$E$6)))","v":0},{"$f":"((esempio!$E$19*(esempio!$E$25/100))*(esempio!$E$26*(1+'prezzi combustibile'!$F$6)))","v":0},{"$f":"((esempio!$E$19*(esempio!$E$25/100))*(esempio!$E$26*(1+'prezzi combustibile'!$G$6)))","v":0},{"$f":"((esempio!$E$19*(esempio!$E$25/100))*(esempio!$E$26*(1+'prezzi combustibile'!$H$6)))","v":0},{"$f":"((esempio!$E$19*(esempio!$E$25/100))*(esempio!$E$26*(1+'prezzi combustibile'!$I$6)))","v":0},{"$f":"((esempio!$E$19*(esempio!$E$25/100))*(esempio!$E$26*(1+'prezzi combustibile'!$J$6)))","v":0},{"$f":"((esempio!$E$19*(esempio!$E$25/100))*(esempio!$E$26*(1+$K$6)))","v":0},{"$f":"((esempio!$E$19*(esempio!$E$25/100))*(esempio!$E$26*(1+$L$6)))","v":0},{"$f":"((esempio!$E$19*(esempio!$E$25/100))*(esempio!$E$26*(1+$M$6)))","v":0},{"$f":"((esempio!$E$19*(esempio!$E$25/100))*(esempio!$E$26*(1+$N$6)))","v":0},{"$f":"SUM(AE39:INDEX(AE39:AO39,esempio!$E$6))","v":0}]
[null,"carburante 1",null,null,null,null,"costo totale per il carburante per il periodo specificato",null,null,null,null,null,null,null,null,"Product 2",{"$f":"((esempio!$G$19*(esempio!$G$21/100))*esempio!$G$22)","v":31817.599999999999},{"$f":"((esempio!$G$19*(esempio!$G$21/100))*(esempio!$G$22*(1+'prezzi combustibile'!$E$6)))","v":30615.170056226292},{"$f":"((esempio!$G$19*(esempio!$G$21/100))*(esempio!$G$22*(1+'prezzi combustibile'!$F$6)))","v":30176.087370141242},{"$f":"((esempio!$G$19*(esempio!$G$21/100))*(esempio!$G$22*(1+'prezzi combustibile'!$G$6)))","v":30193.538142009013},{"$f":"((esempio!$G$19*(esempio!$G$21/100))*(esempio!$G$22*(1+'prezzi combustibile'!$H$6)))","v":30527.696000373278},{"$f":"((esempio!$G$19*(esempio!$G$21/100))*(esempio!$G$22*(1+'prezzi combustibile'!$I$6)))","v":31218.705728184275},{"$f":"((esempio!$G$19*(esempio!$G$21/100))*(esempio!$G$22*(1+'prezzi combustibile'!$J$6)))","v":31758.534488262892},{"$f":"((esempio!$G$19*(esempio!$G$21/100))*(esempio!$G$22*(1+'prezzi combustibile'!$K$6)))","v":32354.935497338633},{"$f":"((esempio!$G$19*(esempio!$G$21/100))*(esempio!$G$22*(1+'prezzi combustibile'!$L$6)))","v":32993.413602892077},{"$f":"((esempio!$G$19*(esempio!$G$21/100))*(esempio!$G$22*(1+'prezzi combustibile'!$M$6)))","v":33428.997909896229},{"$f":"((esempio!$G$19*(esempio!$G$21/100))*(esempio!$G$22*(1+'prezzi combustibile'!$N$6)))","v":33840.939983999568},{"$f":"SUM(Q40:INDEX(Q40:AA40,esempio!$G$6))","v":315084.67879532394},null,"Product 2",{"$f":"((esempio!$G$19*(esempio!$G$25/100))*esempio!$G$26)","v":200000},{"$f":"((esempio!$G$19*(esempio!$G$25/100))*(esempio!$G$26*(1+'prezzi combustibile'!$E$6)))","v":192441.73071649836},{"$f":"((esempio!$G$19*(esempio!$G$25/100))*(esempio!$G$26*(1+'prezzi combustibile'!$F$6)))","v":189681.73193541463},{"$f":"((esempio!$G$19*(esempio!$G$25/100))*(esempio!$G$26*(1+'prezzi combustibile'!$G$6)))","v":189791.42450724763},{"$f":"((esempio!$G$19*(esempio!$G$25/100))*(esempio!$G$26*(1+'prezzi combustibile'!$H$6)))","v":191891.88373964897},{"$f":"((esempio!$G$19*(esempio!$G$25/100))*(esempio!$G$26*(1+'prezzi combustibile'!$I$6)))","v":196235.45288258244},{"$f":"((esempio!$G$19*(esempio!$G$25/100))*(esempio!$G$26*(1+'prezzi combustibile'!$J$6)))","v":199628.72428003929},{"$f":"((esempio!$G$19*(esempio!$G$25/100))*(esempio!$G$26*(1+$K$6)))","v":200000},{"$f":"((esempio!$G$19*(esempio!$G$25/100))*(esempio!$G$26*(1+$L$6)))","v":200000},{"$f":"((esempio!$G$19*(esempio!$G$25/100))*(esempio!$G$26*(1+$M$6)))","v":200000},{"$f":"((esempio!$G$19*(esempio!$G$25/100))*(esempio!$G$26*(1+$N$6)))","v":200000},{"$f":"SUM(AE40:INDEX(AE40:AO40,esempio!$E$6))","v":1959670.9480614313}]
[null,"tipo carburante","contenuto energetico","unità di misura","unità di misura consumo combustibile","unità di misura costo","prodotto 1","prodotto 2","prodotto 3","prodotto 4","prodotto 5",null,null,null,null,"Product 3",{"$f":"((esempio!$I$19*(esempio!$I$21/100))*esempio!$I$22)","v":36000},{"$f":"((esempio!$I$19*(esempio!$I$21/100))*(esempio!$I$22*(1+'prezzi combustibile'!$E$6)))","v":34639.511528969706},{"$f":"((esempio!$I$19*(esempio!$I$21/100))*(esempio!$I$22*(1+'prezzi combustibile'!$F$6)))","v":34142.711748374633},{"$f":"((esempio!$I$19*(esempio!$I$21/100))*(esempio!$I$22*(1+'prezzi combustibile'!$G$6)))","v":34162.456411304578},{"$f":"((esempio!$I$19*(esempio!$I$21/100))*(esempio!$I$22*(1+'prezzi combustibile'!$H$6)))","v":34540.539073136817},{"$f":"((esempio!$I$19*(esempio!$I$21/100))*(esempio!$I$22*(1+'prezzi combustibile'!$I$6)))","v":35322.381518864837},{"$f":"((esempio!$I$19*(esempio!$I$21/100))*(esempio!$I$22*(1+'prezzi combustibile'!$J$6)))","v":35933.170370407068},{"$f":"((esempio!$I$19*(esempio!$I$21/100))*(esempio!$I$22*(1+'prezzi combustibile'!$K$6)))","v":36607.96785125813},{"$f":"((esempio!$I$19*(esempio!$I$21/100))*(esempio!$I$22*(1+'prezzi combustibile'!$L$6)))","v":37330.373431814936},{"$f":"((esempio!$I$19*(esempio!$I$21/100))*(esempio!$I$22*(1+'prezzi combustibile'!$M$6)))","v":37823.21497398497},{"$f":"((esempio!$I$19*(esempio!$I$21/100))*(esempio!$I$22*(1+'prezzi combustibile'!$N$6)))","v":38289.306529216054},{"$f":"SUM(Q41:INDEX(Q41:AA41,esempio!$I$6))","v":356502.32690811565},null,"Product 3",{"$f":"((esempio!$I$19*(esempio!$I$25/100))*esempio!$I$26)","v":0},{"$f":"((esempio!$I$19*(esempio!$I$25/100))*(esempio!$I$26*(1+'prezzi combustibile'!$E$6)))","v":0},{"$f":"((esempio!$I$19*(esempio!$I$25/100))*(esempio!$I$26*(1+'prezzi combustibile'!$F$6)))","v":0},{"$f":"((esempio!$I$19*(esempio!$I$25/100))*(esempio!$I$26*(1+'prezzi combustibile'!$G$6)))","v":0},{"$f":"((esempio!$I$19*(esempio!$I$25/100))*(esempio!$I$26*(1+'prezzi combustibile'!$H$6)))","v":0},{"$f":"((esempio!$I$19*(esempio!$I$25/100))*(esempio!$I$26*(1+'prezzi combustibile'!$I$6)))","v":0},{"$f":"((esempio!$I$19*(esempio!$I$25/100))*(esempio!$I$26*(1+'prezzi combustibile'!$J$6)))","v":0},{"$f":"((esempio!$I$19*(esempio!$I$25/100))*(esempio!$I$26*(1+$K$6)))","v":0},{"$f":"((esempio!$I$19*(esempio!$I$25/100))*(esempio!$I$26*(1+$L$6)))","v":0},{"$f":"((esempio!$I$19*(esempio!$I$25/100))*(esempio!$I$26*(1+$M$6)))","v":0},{"$f":"((esempio!$I$19*(esempio!$I$25/100))*(esempio!$I$26*(1+$N$6)))","v":0},{"$f":"SUM(AE41:INDEX(AE41:AO41,esempio!$E$6))","v":0}]
[null,"Diesel",36,"MJ/l","l/100km","€/l",{"$f":"$AP$4","v":0},{"$f":"$AP$5","v":1959670.9480614313},{"$f":"$AP$6","v":0},{"$f":"$AP$7","v":0},{"$f":"$AP$8","v":0},null,null,null,null,"Product 4",{"$f":"((esempio!$K$19*(esempio!$K$21/100))*esempio!$K$22)","v":0},{"$f":"((esempio!$K$19*(esempio!$K$21/100))*(esempio!$K$22*(1+'prezzi combustibile'!$E$6)))","v":0},{"$f":"((esempio!$K$19*(esempio!$K$21/100))*(esempio!$K$22*(1+'prezzi combustibile'!$F$6)))","v":0},{"$f":"((esempio!$K$19*(esempio!$K$21/100))*(esempio!$K$22*(1+'prezzi combustibile'!$G$6)))","v":0},{"$f":"((esempio!$K$19*(esempio!$K$21/100))*(esempio!$K$22*(1+'prezzi combustibile'!$H$6)))","v":0},{"$f":"((esempio!$K$19*(esempio!$K$21/100))*(esempio!$K$22*(1+'prezzi combustibile'!$I$6)))","v":0},{"$f":"((esempio!$K$19*(esempio!$K$21/100))*(esempio!$K$22*(1+'prezzi combustibile'!$J$6)))","v":0},{"$f":"((esempio!$K$19*(esempio!$K$21/100))*(esempio!$K$22*(1+'prezzi combustibile'!$K$6)))","v":0},{"$f":"((esempio!$K$19*(esempio!$K$21/100))*(esempio!$K$22*(1+'prezzi combustibile'!$L$6)))","v":0},{"$f":"((esempio!$K$19*(esempio!$K$21/100))*(esempio!$K$22*(1+'prezzi combustibile'!$M$6)))","v":0},{"$f":"((esempio!$K$19*(esempio!$K$21/100))*(esempio!$K$22*(1+'prezzi combustibile'!$N$6)))","v":0},{"$f":"SUM(Q42:INDEX(Q42:AA42,esempio!$K$6))","v":0},null,"Product 4",{"$f":"((esempio!$K$19*(esempio!$K$25/100))*esempio!$K$26)","v":0},{"$f":"((esempio!$K$19*(esempio!$K$25/100))*(esempio!$K$26*(1+'prezzi combustibile'!$E$6)))","v":0},{"$f":"((esempio!$K$19*(esempio!$K$25/100))*(esempio!$K$26*(1+'prezzi combustibile'!$F$6)))","v":0},{"$f":"((esempio!$K$19*(esempio!$K$25/100))*(esempio!$K$26*(1+'prezzi combustibile'!$G$6)))","v":0},{"$f":"((esempio!$K$19*(esempio!$K$25/100))*(esempio!$K$26*(1+'prezzi combustibile'!$H$6)))","v":0},{"$f":"((esempio!$K$19*(esempio!$K$25/100))*(esempio!$K$26*(1+'prezzi combustibile'!$I$6)))","v":0},{"$f":"((esempio!$K$19*(esempio!$K$25/100))*(esempio!$K$26*(1+'prezzi combustibile'!$J$6)))","v":0},{"$f":"((esempio!$K$19*(esempio!$K$25/100))*(esempio!$K$26*(1+$K$6)))","v":0},{"$f":"((esempio!$K$19*(esempio!$K$25/100))*(esempio!$K$26*(1+$L$6)))","v":0},{"$f":"((esempio!$K$19*(esempio!$K$25/100))*(esempio!$K$26*(1+$M$6)))","v":0},{"$f":"((esempio!$K$19*(esempio!$K$25/100))*(esempio!$K$26*(1+$N$6)))","v":0},{"$f":"SUM(AE42:INDEX(AE42:AO42,esempio!$E$6))","v":0}]
[null,"benzina",32,"MJ/l","l/100km","€/l",{"$f":"$AP$11","v":0},{"$f":"$AP$12","v":1959670.9480614313},{"$f":"$AP$13","v":0},{"$f":"$AP$14","v":0},{"$f":"$AP$15","v":0},null,null,null,null,"Product 5",{"$f":"((esempio!$M$19*(esempio!$M$21/100))*esempio!$M$22)","v":0},{"$f":"((esempio!$M$19*(esempio!$M$21/100))*(esempio!$M$22*(1+'prezzi combustibile'!$E$6)))","v":0},{"$f":"((esempio!$M$19*(esempio!$M$21/100))*(esempio!$M$22*(1+'prezzi combustibile'!$F$6)))","v":0},{"$f":"((esempio!$M$19*(esempio!$M$21/100))*(esempio!$M$22*(1+'prezzi combustibile'!$G$6)))","v":0},{"$f":"((esempio!$M$19*(esempio!$M$21/100))*(esempio!$M$22*(1+'prezzi combustibile'!$H$6)))","v":0},{"$f":"((esempio!$M$19*(esempio!$M$21/100))*(esempio!$M$22*(1+'prezzi combustibile'!$I$6)))","v":0},{"$f":"((esempio!$M$19*(esempio!$M$21/100))*(esempio!$M$22*(1+'prezzi combustibile'!$J$6)))","v":0},{"$f":"((esempio!$M$19*(esempio!$M$21/100))*(esempio!$M$22*(1+'prezzi combustibile'!$K$6)))","v":0},{"$f":"((esempio!$M$19*(esempio!$M$21/100))*(esempio!$M$22*(1+'prezzi combustibile'!$L$6)))","v":0},{"$f":"((esempio!$M$19*(esempio!$M$21/100))*(esempio!$M$22*(1+'prezzi combustibile'!$M$6)))","v":0},{"$f":"((esempio!$M$19*(esempio!$M$21/100))*(esempio!$M$22*(1+'prezzi combustibile'!$N$6)))","v":0},{"$f":"SUM(Q43:INDEX(Q43:AA43,esempio!$M$6))","v":0},null,"Product 5",{"$f":"((esempio!$M$19*(esempio!$M$25/100))*esempio!$M$26)","v":0},{"$f":"((esempio!$M$19*(esempio!$M$25/100))*(esempio!$M$26*(1+'prezzi combustibile'!$E$6)))","v":0},{"$f":"((esempio!$M$19*(esempio!$M$25/100))*(esempio!$M$26*(1+'prezzi combustibile'!$F$6)))","v":0},{"$f":"((esempio!$M$19*(esempio!$M$25/100))*(esempio!$M$26*(1+'prezzi combustibile'!$G$6)))","v":0},{"$f":"((esempio!$M$19*(esempio!$M$25/100))*(esempio!$M$26*(1+'prezzi combustibile'!$H$6)))","v":0},{"$f":"((esempio!$M$19*(esempio!$M$25/100))*(esempio!$M$26*(1+'prezzi combustibile'!$I$6)))","v":0},{"$f":"((esempio!$M$19*(esempio!$M$25/100))*(esempio!$M$26*(1+'prezzi combustibile'!$J$6)))","v":0},{"$f":"((esempio!$M$19*(esempio!$M$25/100))*(esempio!$M$26*(1+$K$6)))","v":0},{"$f":"((esempio!$M$19*(esempio!$M$25/100))*(esempio!$M$26*(1+$L$6)))","v":0},{"$f":"((esempio!$M$19*(esempio!$M$25/100))*(esempio!$M$26*(1+$M$6)))","v":0},{"$f":"((esempio!$M$19*(esempio!$M$25/100))*(esempio!$M$26*(1+$N$6)))","v":0},{"$f":"SUM(AE43:INDEX(AE43:AO43,esempio!$E$6))","v":0}]
[null,"Biogas/CBG",35,"MJ/Nm3","Nm3/100km","€/Nm3"]
[null,"Natural Gas/CNG (Nm3/100km)",35,"MJ/Nm3","Nm3/100km","€/Nm3",{"$f":"$AP$46","v":0},{"$f":"$AP$47","v":1959670.9480614313},{"$f":"$AP$48","v":0},{"$f":"$AP$49","v":0},{"$f":"$AP$50","v":0},null,null,null,null,"NATURAL GAS",2014,2015,2016,2017,2018,2019,2020,2021,2022,2023,2024,"Total fuel price for period",null,"NATURAL GAS",2014,2015,2016,2017,2018,2019,2020,2021,2022,2023,2024,"Total fuel price for period"]
[null,"Natural Gas/CNG (kg/100km)",null,"MJ/kg","kg/100km","€/kg",{"$f":"$AP$46","v":0},{"$f":"$AP$47","v":1959670.9480614313},{"$f":"$AP$48","v":0},{"$f":"$AP$49","v":0},{"$f":"$AP$50","v":0},null,null,null,null,"Product 1",{"$f":"((esempio!$E$19*(esempio!$E$21/100))*esempio!$E$22)","v":40894.400000000001},{"$f":"((esempio!$E$19*(esempio!$E$21/100))*(esempio!$E$22*(1+'prezzi combustibile'!$E$6)))","v":39348.945563063855},{"$f":"((esempio!$E$19*(esempio!$E$21/100))*(esempio!$E$22*(1+'prezzi combustibile'!$F$6)))","v":38784.603092298101},{"$f":"((esempio!$E$19*(esempio!$E$21/100))*(esempio!$E$22*(1+'prezzi combustibile'!$G$6)))","v":38807.032151845939},{"$f":"((esempio!$E$19*(esempio!$E$21/100))*(esempio!$E$22*(1+'prezzi combustibile'!$H$6)))","v":39236.517252013509},{"$f":"((esempio!$E$19*(esempio!$E$21/100))*(esempio!$E$22*(1+'prezzi combustibile'!$I$6)))","v":40124.655521807399},{"$f":"((esempio!$E$19*(esempio!$E$21/100))*(esempio!$E$22*(1+'prezzi combustibile'!$J$6)))","v":40818.484510988194},{"$f":"((esempio!$E$19*(esempio!$E$21/100))*(esempio!$E$22*(1+'prezzi combustibile'!$K$6)))","v":41585.02445823585},{"$f":"((esempio!$E$19*(esempio!$E$21/100))*(esempio!$E$22*(1+'prezzi combustibile'!$L$6)))","v":42405.645090833677},{"$f":"((esempio!$E$19*(esempio!$E$21/100))*(esempio!$E$22*(1+'prezzi combustibile'!$M$6)))","v":42965.491178670309},{"$f":"((esempio!$E$19*(esempio!$E$21/100))*(esempio!$E$22*(1+'prezzi combustibile'!$N$6)))","v":43494.950470232572},{"$f":"SUM(Q46:INDEX(Q46:AA46,esempio!$E$6))","v":404970.79881975683},null,"Product 1",{"$f":"((esempio!$E$19*(esempio!$E$25/100))*esempio!$E$26)","v":0},{"$f":"((esempio!$E$19*(esempio!$E$25/100))*(esempio!$E$26*(1+'prezzi combustibile'!$E$6)))","v":0},{"$f":"((esempio!$E$19*(esempio!$E$25/100))*(esempio!$E$26*(1+'prezzi combustibile'!$F$6)))","v":0},{"$f":"((esempio!$E$19*(esempio!$E$25/100))*(esempio!$E$26*(1+'prezzi combustibile'!$G$6)))","v":0},{"$f":"((esempio!$E$19*(esempio!$E$25/100))*(esempio!$E$26*(1+'prezzi combustibile'!$H$6)))","v":0},{"$f":"((esempio!$E$19*(esempio!$E$25/100))*(esempio!$E$26*(1+'prezzi combustibile'!$I$6)))","v":0},{"$f":"((esempio!$E$19*(esempio!$E$25/100))*(esempio!$E$26*(1+'prezzi combustibile'!$J$6)))","v":0},{"$f":"((esempio!$E$19*(esempio!$E$25/100))*(esempio!$E$26*(1+$K$6)))","v":0},{"$f":"((esempio!$E$19*(esempio!$E$25/100))*(esempio!$E$26*(1+$L$6)))","v":0},{"$f":"((esempio!$E$19*(esempio!$E$25/100))*(esempio!$E$26*(1+$M$6)))","v":0},{"$f":"((esempio!$E$19*(esempio!$E$25/100))*(esempio!$E$26*(1+$N$6)))","v":0},{"$f":"SUM(AE46:INDEX(AE46:AO46,esempio!$E$6))","v":0}]
[null,"elettricità",3.6,"MJ/kWh","kWh/100km","€/kWh",{"$f":"$AP$32","v":0},{"$f":"$AP$33","v":1959670.9480614313},{"$f":"$AP$34","v":0},{"$f":"$AP$35","v":0},{"$f":"$AP$36","v":0},null,null,null,null,"Product 2",{"$f":"((esempio!$G$19*(esempio!$G$21/100))*esempio!$G$22)","v":31817.599999999999},{"$f":"((esempio!$G$19*(esempio!$G$21/100))*(esempio!$G$22*(1+'prezzi combustibile'!$E$6)))","v":30615.170056226292},{"$f":"((esempio!$G$19*(esempio!$G$21/100))*(esempio!$G$22*(1+'prezzi combustibile'!$F$6)))","v":30176.087370141242},{"$f":"((esempio!$G$19*(esempio!$G$21/100))*(esempio!$G$22*(1+'prezzi combustibile'!$G$6)))","v":30193.538142009013},{"$f":"((esempio!$G$19*(esempio!$G$21/100))*(esempio!$G$22*(1+'prezzi combustibile'!$H$6)))","v":30527.696000373278},{"$f":"((esempio!$G$19*(esempio!$G$21/100))*(esempio!$G$22*(1+'prezzi combustibile'!$I$6)))","v":31218.705728184275},{"$f":"((esempio!$G$19*(esempio!$G$21/100))*(esempio!$G$22*(1+'prezzi combustibile'!$J$6)))","v":31758.534488262892},{"$f":"((esempio!$G$19*(esempio!$G$21/100))*(esempio!$G$22*(1+'prezzi combustibile'!$K$6)))","v":32354.935497338633},{"$f":"((esempio!$G$19*(esempio!$G$21/100))*(esempio!$G$22*(1+'prezzi combustibile'!$L$6)))","v":32993.413602892077},{"$f":"((esempio!$G$19*(esempio!$G$21/100))*(esempio!$G$22*(1+'prezzi combustibile'!$M$6)))","v":33428.997909896229},{"$f":"((esempio!$G$19*(esempio!$G$21/100))*(esempio!$G$22*(1+'prezzi combustibile'!$N$6)))","v":33840.939983999568},{"$f":"SUM(Q47:INDEX(Q47:AA47,esempio!$G$6))","v":315084.67879532394},null,"Product 2",{"$f":"((esempio!$G$19*(esempio!$G$25/100))*esempio!$G$26)","v":200000},{"$f":"((esempio!$G$19*(esempio!$G$25/100))*(esempio!$G$26*(1+'prezzi combustibile'!$E$6)))","v":192441.73071649836},{"$f":"((esempio!$G$19*(esempio!$G$25/100))*(esempio!$G$26*(1+'prezzi combustibile'!$F$6)))","v":189681.73193541463},{"$f":"((esempio!$G$19*(esempio!$G$25/100))*(esempio!$G$26*(1+'prezzi combustibile'!$G$6)))","v":189791.42450724763},{"$f":"((esempio!$G$19*(esempio!$G$25/100))*(esempio!$G$26*(1+'prezzi combustibile'!$H$6)))","v":191891.88373964897},{"$f":"((esempio!$G$19*(esempio!$G$25/100))*(esempio!$G$26*(1+'prezzi combustibile'!$I$6)))","v":196235.45288258244},{"$f":"((esempio!$G$19*(esempio!$G$25/100))*(esempio!$G$26*(1+'prezzi combustibile'!$J$6)))","v":199628.72428003929},{"$f":"((esempio!$G$19*(esempio!$G$25/100))*(esempio!$G$26*(1+$K$6)))","v":200000},{"$f":"((esempio!$G$19*(esempio!$G$25/100))*(esempio!$G$26*(1+$L$6)))","v":200000},{"$f":"((esempio!$G$19*(esempio!$G$25/100))*(esempio!$G$26*(1+$M$6)))","v":200000},{"$f":"((esempio!$G$19*(esempio!$G$25/100))*(esempio!$G$26*(1+$N$6)))","v":200000},{"$f":"SUM(AE47:INDEX(AE47:AO47,esempio!$E$6))","v":1959670.9480614313}]
[null,"biodiesel",33,"MJ/l","l/100km","€/l",{"$f":"$AP$39","v":0},{"$f":"$AP$40","v":1959670.9480614313},{"$f":"$AP$41","v":0},{"$f":"$AP$42","v":0},{"$f":"$AP$43","v":0},null,null,null,null,"Product 3",{"$f":"((esempio!$I$19*(esempio!$I$21/100))*esempio!$I$22)","v":36000},{"$f":"((esempio!$I$19*(esempio!$I$21/100))*(esempio!$I$22*(1+'prezzi combustibile'!$E$6)))","v":34639.511528969706},{"$f":"((esempio!$I$19*(esempio!$I$21/100))*(esempio!$I$22*(1+'prezzi combustibile'!$F$6)))","v":34142.711748374633},{"$f":"((esempio!$I$19*(esempio!$I$21/100))*(esempio!$I$22*(1+'prezzi combustibile'!$G$6)))","v":34162.456411304578},{"$f":"((esempio!$I$19*(esempio!$I$21/100))*(esempio!$I$22*(1+'prezzi combustibile'!$H$6)))","v":34540.539073136817},{"$f":"((esempio!$I$19*(esempio!$I$21/100))*(esempio!$I$22*(1+'prezzi combustibile'!$I$6)))","v":35322.381518864837},{"$f":"((esempio!$I$19*(esempio!$I$21/100))*(esempio!$I$22*(1+'prezzi combustibile'!$J$6)))","v":35933.170370407068},{"$f":"((esempio!$I$19*(esempio!$I$21/100))*(esempio!$I$22*(1+'prezzi combustibile'!$K$6)))","v":36607.96785125813},{"$f":"((esempio!$I$19*(esempio!$I$21/100))*(esempio!$I$22*(1+'prezzi combustibile'!$L$6)))","v":37330.373431814936},{"$f":"((esempio!$I$19*(esempio!$I$21/100))*(esempio!$I$22*(1+'prezzi combustibile'!$M$6)))","v":37823.21497398497},{"$f":"((esempio!$I$19*(esempio!$I$21/100))*(esempio!$I$22*(1+'prezzi combustibile'!$N$6)))","v":38289.306529216054},{"$f":"SUM(Q48:INDEX(Q48:AA48,esempio!$I$6))","v":356502.32690811565},null,"Product 3",{"$f":"((esempio!$I$19*(esempio!$I$25/100))*esempio!$I$26)","v":0},{"$f":"((esempio!$I$19*(esempio!$I$25/100))*(esempio!$I$26*(1+'prezzi combustibile'!$E$6)))","v":0},{"$f":"((esempio!$I$19*(esempio!$I$25/100))*(esempio!$I$26*(1+'prezzi combustibile'!$F$6)))","v":0},{"$f":"((esempio!$I$19*(esempio!$I$25/100))*(esempio!$I$26*(1+'prezzi combustibile'!$G$6)))","v":0},{"$f":"((esempio!$I$19*(esempio!$I$25/100))*(esempio!$I$26*(1+'prezzi combustibile'!$H$6)))","v":0},{"$f":"((esempio!$I$19*(esempio!$I$25/100))*(esempio!$I$26*(1+'prezzi combustibile'!$I$6)))","v":0},{"$f":"((esempio!$I$19*(esempio!$I$25/100))*(esempio!$I$26*(1+'prezzi combustibile'!$J$6)))","v":0},{"$f":"((esempio!$I$19*(esempio!$I$25/100))*(esempio!$I$26*(1+$K$6)))","v":0},{"$f":"((esempio!$I$19*(esempio!$I$25/100))*(esempio!$I$26*(1+$L$6)))","v":0},{"$f":"((esempio!$I$19*(esempio!$I$25/100))*(esempio!$I$26*(1+$M$6)))","v":0},{"$f":"((esempio!$I$19*(esempio!$I$25/100))*(esempio!$I$26*(1+$N$6)))","v":0},{"$f":"SUM(AE48:INDEX(AE48:AO48,esempio!$E$6))","v":0}]
[null,"LPG",24,"MJ/l","l/100km","€/l",{"$f":"$AP$18","v":0},{"$f":"$AP$19","v":1959670.9480614313},{"$f":"$AP$20","v":0},{"$f":"$AP$21","v":0},{"$f":"$AP$22","v":0},null,null,null,null,"Product 4",{"$f":"((esempio!$K$19*(esempio!$K$21/100))*esempio!$K$22)","v":0},{"$f":"((esempio!$K$19*(esempio!$K$21/100))*(esempio!$K$22*(1+'prezzi combustibile'!$E$6)))","v":0},{"$f":"((esempio!$K$19*(esempio!$K$21/100))*(esempio!$K$22*(1+'prezzi combustibile'!$F$6)))","v":0},{"$f":"((esempio!$K$19*(esempio!$K$21/100))*(esempio!$K$22*(1+'prezzi combustibile'!$G$6)))","v":0},{"$f":"((esempio!$K$19*(esempio!$K$21/100))*(esempio!$K$22*(1+'prezzi combustibile'!$H$6)))","v":0},{"$f":"((esempio!$K$19*(esempio!$K$21/100))*(esempio!$K$22*(1+'prezzi combustibile'!$I$6)))","v":0},{"$f":"((esempio!$K$19*(esempio!$K$21/100))*(esempio!$K$22*(1+'prezzi combustibile'!$J$6)))","v":0},{"$f":"((esempio!$K$19*(esempio!$K$21/100))*(esempio!$K$22*(1+'prezzi combustibile'!$K$6)))","v":0},{"$f":"((esempio!$K$19*(esempio!$K$21/100))*(esempio!$K$22*(1+'prezzi combustibile'!$L$6)))","v":0},{"$f":"((esempio!$K$19*(esempio!$K$21/100))*(esempio!$K$22*(1+'prezzi combustibile'!$M$6)))","v":0},{"$f":"((esempio!$K$19*(esempio!$K$21/100))*(esempio!$K$22*(1+'prezzi combustibile'!$N$6)))","v":0},{"$f":"SUM(Q49:INDEX(Q49:AA49,esempio!$K$6))","v":0},null,"Product 4",{"$f":"((esempio!$K$19*(esempio!$K$25/100))*esempio!$K$26)","v":0},{"$f":"((esempio!$K$19*(esempio!$K$25/100))*(esempio!$K$26*(1+'prezzi combustibile'!$E$6)))","v":0},{"$f":"((esempio!$K$19*(esempio!$K$25/100))*(esempio!$K$26*(1+'prezzi combustibile'!$F$6)))","v":0},{"$f":"((esempio!$K$19*(esempio!$K$25/100))*(esempio!$K$26*(1+'prezzi combustibile'!$G$6)))","v":0},{"$f":"((esempio!$K$19*(esempio!$K$25/100))*(esempio!$K$26*(1+'prezzi combustibile'!$H$6)))","v":0},{"$f":"((esempio!$K$19*(esempio!$K$25/100))*(esempio!$K$26*(1+'prezzi combustibile'!$I$6)))","v":0},{"$f":"((esempio!$K$19*(esempio!$K$25/100))*(esempio!$K$26*(1+'prezzi combustibile'!$J$6)))","v":0},{"$f":"((esempio!$K$19*(esempio!$K$25/100))*(esempio!$K$26*(1+$K$6)))","v":0},{"$f":"((esempio!$K$19*(esempio!$K$25/100))*(esempio!$K$26*(1+$L$6)))","v":0},{"$f":"((esempio!$K$19*(esempio!$K$25/100))*(esempio!$K$26*(1+$M$6)))","v":0},{"$f":"((esempio!$K$19*(esempio!$K$25/100))*(esempio!$K$26*(1+$N$6)))","v":0},{"$f":"SUM(AE49:INDEX(AE49:AO49,esempio!$E$6))","v":0}]
[null,"etanolo",21,"MJ/l","l/100km","€/l",{"$f":"$AP$25","v":0},{"$f":"$AP$26","v":1959670.9480614313},{"$f":"$AP$27","v":0},{"$f":"$AP$28","v":0},{"$f":"$AP$29","v":0},null,null,null,null,"Product 5",{"$f":"((esempio!$M$19*(esempio!$M$21/100))*esempio!$M$22)","v":0},{"$f":"((esempio!$M$19*(esempio!$M$21/100))*(esempio!$M$22*(1+'prezzi combustibile'!$E$6)))","v":0},{"$f":"((esempio!$M$19*(esempio!$M$21/100))*(esempio!$M$22*(1+'prezzi combustibile'!$F$6)))","v":0},{"$f":"((esempio!$M$19*(esempio!$M$21/100))*(esempio!$M$22*(1+'prezzi combustibile'!$G$6)))","v":0},{"$f":"((esempio!$M$19*(esempio!$M$21/100))*(esempio!$M$22*(1+'prezzi combustibile'!$H$6)))","v":0},{"$f":"((esempio!$M$19*(esempio!$M$21/100))*(esempio!$M$22*(1+'prezzi combustibile'!$I$6)))","v":0},{"$f":"((esempio!$M$19*(esempio!$M$21/100))*(esempio!$M$22*(1+'prezzi combustibile'!$J$6)))","v":0},{"$f":"((esempio!$M$19*(esempio!$M$21/100))*(esempio!$M$22*(1+'prezzi combustibile'!$K$6)))","v":0},{"$f":"((esempio!$M$19*(esempio!$M$21/100))*(esempio!$M$22*(1+'prezzi combustibile'!$L$6)))","v":0},{"$f":"((esempio!$M$19*(esempio!$M$21/100))*(esempio!$M$22*(1+'prezzi combustibile'!$M$6)))","v":0},{"$f":"((esempio!$M$19*(esempio!$M$21/100))*(esempio!$M$22*(1+'prezzi combustibile'!$N$6)))","v":0},{"$f":"SUM(Q50:INDEX(Q50:AA50,esempio!$M$6))","v":0},null,"Product 5",{"$f":"((esempio!$M$19*(esempio!$M$25/100))*esempio!$M$26)","v":0},{"$f":"((esempio!$M$19*(esempio!$M$25/100))*(esempio!$M$26*(1+'prezzi combustibile'!$E$6)))","v":0},{"$f":"((esempio!$M$19*(esempio!$M$25/100))*(esempio!$M$26*(1+'prezzi combustibile'!$F$6)))","v":0},{"$f":"((esempio!$M$19*(esempio!$M$25/100))*(esempio!$M$26*(1+'prezzi combustibile'!$G$6)))","v":0},{"$f":"((esempio!$M$19*(esempio!$M$25/100))*(esempio!$M$26*(1+'prezzi combustibile'!$H$6)))","v":0},{"$f":"((esempio!$M$19*(esempio!$M$25/100))*(esempio!$M$26*(1+'prezzi combustibile'!$I$6)))","v":0},{"$f":"((esempio!$M$19*(esempio!$M$25/100))*(esempio!$M$26*(1+'prezzi combustibile'!$J$6)))","v":0},{"$f":"((esempio!$M$19*(esempio!$M$25/100))*(esempio!$M$26*(1+$K$6)))","v":0},{"$f":"((esempio!$M$19*(esempio!$M$25/100))*(esempio!$M$26*(1+$L$6)))","v":0},{"$f":"((esempio!$M$19*(esempio!$M$25/100))*(esempio!$M$26*(1+$M$6)))","v":0},{"$f":"((esempio!$M$19*(esempio!$M$25/100))*(esempio!$M$26*(1+$N$6)))","v":0},{"$f":"SUM(AE50:INDEX(AE50:AO50,esempio!$E$6))","v":0}]
[null,"idrogeno gas",11,"MJ/Nm3","Nm3/100km","€/Nm3"]
[null,"idrogeno liquido - kg/100km",120,"MJ/kg","kg/100km","€/kg",null,null,null,null,null,null,null,null,null,"BATTERY",2014,2015,2016,2017,2018,2019,2020,2021,2022,2023,2024,"Cost of replacements for period",null,"BATTERY",2014,2015,2016,2017,2018,2019,2020,2021,2022,2023,2024,"Cost of replacements for period"]
[null,"idrogeno liquido - l/100km",8.6,"MJ/l","l/100km","€/l",null,null,null,null,null,null,null,null,null,"Product 1",0,{"$f":"IF(esempio!$E$28=1,esempio!$E$27,0)","v":0},{"$f":"IF(OR(esempio!$E$28=1,$E$24=2),esempio!$E$27,0)","v":0},{"$f":"IF(OR(esempio!$E$28=1,esempio!$E$28=3),esempio!$E$27,0)","v":0},{"$f":"IF(OR(esempio!$E$28=1,esempio!$E$28=2,esempio!$E$28=4),esempio!$E$27,0)","v":0},{"$f":"IF(OR(esempio!$E$28=1,esempio!$E$28=5),esempio!$E$27,0)","v":0},{"$f":"IF(OR(esempio!$E$28=1,esempio!$E$28=2,esempio!$E$28=3,esempio!$E$28=6),esempio!$E$27,0)","v":0},{"$f":"IF(OR(esempio!$E$28=1,esempio!$E$28=7),esempio!$E$27,0)","v":0},{"$f":"IF(OR(esempio!$E$28=1,esempio!$E$28=2,esempio!$E$28=4,esempio!$E$28=8),esempio!$E$27,0)","v":0},{"$f":"IF(OR(esempio!$E$28=1,esempio!$E$28=3,esempio!$E$28=9),esempio!$E$27,0)","v":0},{"$f":"IF(OR(esempio!$E$28=1,esempio!$E$28=2,esempio!$E$28=5,esempio!$E$28=10),esempio!$E$27,0)","v":0},{"$f":"SUM(Q53:INDEX(Q53:AA53,esempio!$E$6))","v":0},null,"Product 1",0,{"$f":"IF(esempio!$E$28=1,esempio!$E$27,0)","v":0},{"$f":"IF(OR(esempio!$E$28=1,$E$24=2),esempio!$E$27,0)","v":0},{"$f":"IF(OR(esempio!$E$28=1,esempio!$E$28=3),esempio!$E$27,0)","v":0},{"$f":"IF(OR(esempio!$E$28=1,esempio!$E$28=2,esempio!$E$28=4),esempio!$E$27,0)","v":0},{"$f":"IF(OR(esempio!$E$28=1,esempio!$E$28=5),esempio!$E$27,0)","v":0},{"$f":"IF(OR(esempio!$E$28=1,esempio!$E$28=2,esempio!$E$28=3,esempio!$E$28=6),esempio!$E$27,0)","v":0},{"$f":"IF(OR(esempio!$E$28=1,esempio!$E$28=7),esempio!$E$27,0)","v":0},{"$f":"IF(OR(esempio!$E$28=1,esempio!$E$28=2,esempio!$E$28=4,esempio!$E$28=8),esempio!$E$27,0)","v":0},{"$f":"IF(OR(esempio!$E$28=1,esempio!$E$28=3,esempio!$E$28=9),esempio!$E$27,0)","v":0},{"$f":"IF(OR(esempio!$E$28=1,esempio!$E$28=2,esempio!$E$28=5,esempio!$E$28=10),esempio!$E$27,0)","v":0},{"$f":"SUM(AE53:INDEX(AE53:AO53,esempio!$E$6))","v":0}]
[null,"Carburante emulsionato ",32,"MJ/l","l/100km","€/l",null,null,null,null,null,null,null,null,null,"Product 2",0,{"$f":"IF(esempio!$G$28=1,esempio!$G$27,0)","v":0},{"$f":"IF(OR(esempio!$G$28=1,$G$24=2),esempio!$G$27,0)","v":0},{"$f":"IF(OR(esempio!$G$28=1,esempio!$G$28=3),esempio!$G$27,0)","v":25},{"$f":"IF(OR(esempio!$G$28=1,esempio!$G$28=2,esempio!$G$28=4),esempio!$G$27,0)","v":0},{"$f":"IF(OR(esempio!$G$28=1,esempio!$G$28=5),esempio!$G$27,0)","v":0},{"$f":"IF(OR(esempio!$G$28=1,esempio!$G$28=2,esempio!$G$28=3,esempio!$G$28=6),esempio!$G$27,0)","v":25},{"$f":"IF(OR(esempio!$G$28=1,esempio!$G$28=7),esempio!$G$27,0)","v":0},{"$f":"IF(OR(esempio!$G$28=1,esempio!$G$28=2,esempio!$G$28=4,esempio!$G$28=8),esempio!$G$27,0)","v":0},{"$f":"IF(OR(esempio!$G$28=1,esempio!$G$28=3,esempio!$G$28=9),esempio!$G$27,0)","v":25},{"$f":"IF(OR(esempio!$G$28=1,esempio!$G$28=2,esempio!$G$28=5,esempio!$G$28=10),esempio!$G$27,0)","v":0},{"$f":"SUM(Q54:INDEX(Q54:AA54,esempio!$E$6))","v":75},null,"Product 2",0,{"$f":"IF(esempio!$G$28=1,esempio!$G$27,0)","v":0},{"$f":"IF(OR(esempio!$G$28=1,$G$24=2),esempio!$G$27,0)","v":0},{"$f":"IF(OR(esempio!$G$28=1,esempio!$G$28=3),esempio!$G$27,0)","v":25},{"$f":"IF(OR(esempio!$G$28=1,esempio!$G$28=2,esempio!$G$28=4),esempio!$G$27,0)","v":0},{"$f":"IF(OR(esempio!$G$28=1,esempio!$G$28=5),esempio!$G$27,0)","v":0},{"$f":"IF(OR(esempio!$G$28=1,esempio!$G$28=2,esempio!$G$28=3,esempio!$G$28=6),esempio!$G$27,0)","v":25},{"$f":"IF(OR(esempio!$G$28=1,esempio!$G$28=7),esempio!$G$27,0)","v":0},{"$f":"IF(OR(esempio!$G$28=1,esempio!$G$28=2,esempio!$G$28=4,esempio!$G$28=8),esempio!$G$27,0)","v":0},{"$f":"IF(OR(esempio!$G$28=1,esempio!$G$28=3,esempio!$G$28=9),esempio!$G$27,0)","v":25},{"$f":"IF(OR(esempio!$G$28=1,esempio!$G$28=2,esempio!$G$28=5,esempio!$G$28=10),esempio!$G$27,0)","v":0},{"$f":"SUM(AE54:INDEX(AE54:AO54,esempio!$E$6))","v":75}]
[null,null,null,null,null,null,null,null,null,null,null,null,null,null,null,"Product 3",0,{"$f":"IF(esempio!$I$28=1,esempio!$I$27,0)","v":0},{"$f":"IF(OR(esempio!$I$28=1,$I$24=2),esempio!$I$27,0)","v":0},{"$f":"IF(OR(esempio!$I$28=1,esempio!$I$28=3),esempio!$I$27,0)","v":0},{"$f":"IF(OR(esempio!$I$28=1,esempio!$I$28=2,esempio!$I$28=4),esempio!$I$27,0)","v":0},{"$f":"IF(OR(esempio!$I$28=1,esempio!$I$28=5),esempio!$I$27,0)","v":0},{"$f":"IF(OR(esempio!$I$28=1,esempio!$I$28=2,esempio!$I$28=3,esempio!$I$28=6),esempio!$I$27,0)","v":0},{"$f":"IF(OR(esempio!$I$28=1,esempio!$I$28=7),esempio!$I$27,0)","v":0},{"$f":"IF(OR(esempio!$I$28=1,esempio!$I$28=2,esempio!$I$28=4,esempio!$I$28=8),esempio!$I$27,0)","v":0},{"$f":"IF(OR(esempio!$I$28=1,esempio!$I$28=3,esempio!$I$28=9),esempio!$I$27,0)","v":0},{"$f":"IF(OR(esempio!$I$28=1,esempio!$I$28=2,esempio!$I$28=5,esempio!$I$28=10),esempio!$I$27,0)","v":0},{"$f":"SUM(Q55:INDEX(Q55:AA55,esempio!$E$6))","v":0},null,"Product 3",0,{"$f":"IF(esempio!$I$28=1,esempio!$I$27,0)","v":0},{"$f":"IF(OR(esempio!$I$28=1,$I$24=2),esempio!$I$27,0)","v":0},{"$f":"IF(OR(esempio!$I$28=1,esempio!$I$28=3),esempio!$I$27,0)","v":0},{"$f":"IF(OR(esempio!$I$28=1,esempio!$I$28=2,esempio!$I$28=4),esempio!$I$27,0)","v":0},{"$f":"IF(OR(esempio!$I$28=1,esempio!$I$28=5),esempio!$I$27,0)","v":0},{"$f":"IF(OR(esempio!$I$28=1,esempio!$I$28=2,esempio!$I$28=3,esempio!$I$28=6),esempio!$I$27,0)","v":0},{"$f":"IF(OR(esempio!$I$28=1,esempio!$I$28=7),esempio!$I$27,0)","v":0},{"$f":"IF(OR(esempio!$I$28=1,esempio!$I$28=2,esempio!$I$28=4,esempio!$I$28=8),esempio!$I$27,0)","v":0},{"$f":"IF(OR(esempio!$I$28=1,esempio!$I$28=3,esempio!$I$28=9),esempio!$I$27,0)","v":0},{"$f":"IF(OR(esempio!$I$28=1,esempio!$I$28=2,esempio!$I$28=5,esempio!$I$28=10),esempio!$I$27,0)","v":0},{"$f":"SUM(AE55:INDEX(AE55:AO55,esempio!$E$6))","v":0}]
[null,"Elenchi a tendina",null,null,null,null,null,null,null,null,null,null,null,null,null,"Product 4",0,{"$f":"IF(esempio!$K$28=1,esempio!$K$27,0)","v":0},{"$f":"IF(OR(esempio!$K$28=1,$K$24=2),esempio!$K$27,0)","v":0},{"$f":"IF(OR(esempio!$K$28=1,esempio!$K$28=3),esempio!$K$27,0)","v":0},{"$f":"IF(OR(esempio!$K$28=1,esempio!$K$28=2,esempio!$K$28=4),esempio!$K$27,0)","v":0},{"$f":"IF(OR(esempio!$K$28=1,esempio!$K$28=5),esempio!$K$27,0)","v":0},{"$f":"IF(OR(esempio!$K$28=1,esempio!$K$28=2,esempio!$K$28=3,esempio!$K$28=6),esempio!$K$27,0)","v":0},{"$f":"IF(OR(esempio!$K$28=1,esempio!$K$28=7),esempio!$K$27,0)","v":0},{"$f":"IF(OR(esempio!$K$28=1,esempio!$K$28=2,esempio!$K$28=4,esempio!$K$28=8),esempio!$K$27,0)","v":0},{"$f":"IF(OR(esempio!$K$28=1,esempio!$K$28=3,esempio!$K$28=9),esempio!$K$27,0)","v":0},{"$f":"IF(OR(esempio!$K$28=1,esempio!$K$28=2,esempio!$K$28=5,esempio!$K$28=10),esempio!$K$27,0)","v":0},{"$f":"SUM(Q56:INDEX(Q56:AA56,esempio!$E$6))","v":0},null,"Product 4",0,{"$f":"IF(esempio!$K$28=1,esempio!$K$27,0)","v":0},{"$f":"IF(OR(esempio!$K$28=1,$K$24=2),esempio!$K$27,0)","v":0},{"$f":"IF(OR(esempio!$K$28=1,esempio!$K$28=3),esempio!$K$27,0)","v":0},{"$f":"IF(OR(esempio!$K$28=1,esempio!$K$28=2,esempio!$K$28=4),esempio!$K$27,0)","v":0},{"$f":"IF(OR(esempio!$K$28=1,esempio!$K$28=5),esempio!$K$27,0)","v":0},{"$f":"IF(OR(esempio!$K$28=1,esempio!$K$28=2,esempio!$K$28=3,esempio!$K$28=6),esempio!$K$27,0)","v":0},{"$f":"IF(OR(esempio!$K$28=1,esempio!$K$28=7),esempio!$K$27,0)","v":0},{"$f":"IF(OR(esempio!$K$28=1,esempio!$K$28=2,esempio!$K$28=4,esempio!$K$28=8),esempio!$K$27,0)","v":0},{"$f":"IF(OR(esempio!$K$28=1,esempio!$K$28=3,esempio!$K$28=9),esempio!$K$27,0)","v":0},{"$f":"IF(OR(esempio!$K$28=1,esempio!$K$28=2,esempio!$K$28=5,esempio!$K$28=10),esempio!$K$27,0)","v":0},{"$f":"SUM(AE56:INDEX(AE56:AO56,esempio!$E$6))","v":0}]
[null,"tipo di contratto","carburante di riferimento","aumento prezzo carburante","sì_no",null,null,null,null,null,null,null,null,null,null,"Product 5",0,{"$f":"IF(esempio!$M$28=1,esempio!$M$27,0)","v":0},{"$f":"IF(OR(esempio!$M$28=1,$M$24=2),esempio!$M$27,0)","v":0},{"$f":"IF(OR(esempio!$M$28=1,esempio!$M$28=3),esempio!$M$27,0)","v":0},{"$f":"IF(OR(esempio!$M$28=1,esempio!$M$28=2,esempio!$M$28=4),esempio!$M$27,0)","v":0},{"$f":"IF(OR(esempio!$M$28=1,esempio!$M$28=5),esempio!$M$27,0)","v":0},{"$f":"IF(OR(esempio!$M$28=1,esempio!$M$28=2,esempio!$M$28=3,esempio!$M$28=6),esempio!$M$27,0)","v":0},{"$f":"IF(OR(esempio!$M$28=1,esempio!$M$28=7),esempio!$M$27,0)","v":0},{"$f":"IF(OR(esempio!$M$28=1,esempio!$M$28=2,esempio!$M$28=4,esempio!$M$28=8),esempio!$M$27,0)","v":0},{"$f":"IF(OR(esempio!$M$28=1,esempio!$M$28=3,esempio!$M$28=9),esempio!$M$27,0)","v":0},{"$f":"IF(OR(esempio!$M$28=1,esempio!$M$28=2,esempio!$M$28=5,esempio!$M$28=10),esempio!$M$27,0)","v":0},{"$f":"SUM(Q57:INDEX(Q57:AA57,esempio!$E$6))","v":0},null,"Product 5",0,{"$f":"IF(esempio!$M$28=1,esempio!$M$27,0)","v":0},{"$f":"IF(OR(esempio!$M$28=1,$M$24=2),esempio!$M$27,0)","v":0},{"$f":"IF(OR(esempio!$M$28=1,esempio!$M$28=3),esempio!$M$27,0)","v":0},{"$f":"IF(OR(esempio!$M$28=1,esempio!$M$28=2,esempio!$M$28=4),esempio!$M$27,0)","v":0},{"$f":"IF(OR(esempio!$M$28=1,esempio!$M$28=5),esempio!$M$27,0)","v":0},{"$f":"IF(OR(esempio!$M$28=1,esempio!$M$28=2,esempio!$M$28=3,esempio!$M$28=6),esempio!$M$27,0)","v":0},{"$f":"IF(OR(esempio!$M$28=1,esempio!$M$28=7),esempio!$M$27,0)","v":0},{"$f":"IF(OR(esempio!$M$28=1,esempio!$M$28=2,esempio!$M$28=4,esempio!$M$28=8),esempio!$M$27,0)","v":0},{"$f":"IF(OR(esempio!$M$28=1,esempio!$M$28=3,esempio!$M$28=9),esempio!$M$27,0)","v":0},{"$f":"IF(OR(esempio!$M$28=1,esempio!$M$28=2,esempio!$M$28=5,esempio!$M$28=10),esempio!$M$27,0)","v":0},{"$f":"SUM(AE57:INDEX(AE57:AO57,esempio!$E$6))","v":0}]
[null,"acquisto","Diesel","scegli uno dei valori","sì "]
[null,"leasing","benzina","Usa i valori OECD-FAO di default","no"]