{"text_format":"1","workbook":"xlsx","n_sheets":7,"sheets":["Warning","LCC","Diagramma","prezzi combustibile","calcoli","esempio","calcolo esempio"],"not_rendered":{"charts":2,"images":3,"macros":1,"external_links":0,"defined_names":22,"comments":2,"pivot_tables":0},"unopened":[],"bounds":{"document_bytes":16777216,"sheet_cells":100000,"rows_first":2000,"rows_last":500,"rows_between":2000,"halvings":0,"cell_chars":16384,"cell_head_chars":4096},"cells_cut":0,"cells_raw":0,"read":"whole","date_system":"1900"}

{"sheet":"Warning","index":0,"n_rows":33,"n_cols":8,"rows_kept":33,"cut":false,"hidden":false,"merged":[[32,6,33,12],[16,3,16,15],[19,5,27,13],[29,3,29,15]]}
[]
[]
[]
[]
[]
[]
{"$rows_left_out":28}
{"sheet":"LCC","index":1,"n_rows":110,"n_cols":23,"rows_kept":110,"cut":false,"hidden":true,"merged":[[67,2,67,3],[68,2,68,3],[66,15,66,16]]}
[]
[null,null,null,"VEICOLI - CALCOLATORE LCC"]
[null,null,null,"completa riempiendo solo le celle bianche "]
[]
[null,"CONDIZIONI GENERALI"]
[null,"i","lunghezza contratto","anno"]
{"$rows_left_out":105}
{"sheet":"Diagramma","index":2,"n_rows":27,"n_cols":31,"rows_kept":27,"cut":false,"hidden":true,"merged":[[2,1,2,25],[26,3,26,5],[27,3,27,6]]}
[]
[]
[null,"DIAGRAMMA DEI RISULTATI LCC"]
[]
[]
[]
{"$rows_left_out":22}
{"sheet":"prezzi combustibile","index":3,"n_rows":97,"n_cols":51,"rows_kept":97,"cut":false,"hidden":true,"merged":[[39,1,40,1],[27,1,28,1],[29,1,30,1],[31,1,32,1],[33,1,34,1],[35,1,36,1],[37,1,38,1]]}
["fonti:",null,"OECD-FAO \n",null,null,null,null,null,null,null,null,null,null,null,null,null,null,null,null,null,null,null,null,"SINGLE FUEL TIME SERIES",null,null,null,null,null,null,null,null,null,null,null,null,"Fuel 1\nTime Series","SECOND FUEL TIME SERIES",null,null,null,null,null,null,null,null,null,null,null,null,"Fuel 2\nTime Series"]
[null,null,"amministazione energia US ",null,null,null,null,null,"5 anni",null,null,null,null,"10 anni"]
[null,null,null,2014,2015,2016,2017,2018,2019,2020,2021,2022,2023,2024,null,null,null,null,null,null,null,null,null,"DIESEL",2014,2015,2016,2017,2018,2019,2020,2021,2022,2023,2024,"Total fuel price for period",null,"DIESEL",2014,2015,2016,2017,2018,2019,2020,2021,2022,2023,2024,"prezzo totale carburante per il periodo"]
["Diesel ","$/gallonee","prezzo previsto",3.6833300000000002,3.5441319999999998,3.4952230000000002,3.4971399999999999,3.533868,3.6106159999999998,3.671875,3.7407020000000002,3.815766,3.868004,3.9180830000000002,null,null,null,null,null,null,null,null,null,"prodotto 1",{"$f":"((LCC!$E$19*(LCC!$E$21/100))*LCC!$E$22)","v":0},{"$f":"((LCC!$E$19*(LCC!$E$21/100))*(LCC!$E$22*(1+$E$6)))","v":0},{"$f":"((LCC!$E$19*(LCC!$E$21/100))*(LCC!$E$22*(1+$F$6)))","v":0},{"$f":"((LCC!$E$19*(LCC!$E$21/100))*(LCC!$E$22*(1+$G$6)))","v":0},{"$f":"((LCC!$E$19*(LCC!$E$21/100))*(LCC!$E$22*(1+$H$6)))","v":0},{"$f":"((LCC!$E$19*(LCC!$E$21/100))*(LCC!$E$22*(1+$I$6)))","v":0},{"$f":"((LCC!$E$19*(LCC!$E$21/100))*(LCC!$E$22*(1+$J$6)))","v":0},{"$f":"((LCC!$E$19*(LCC!$E$21/100))*(LCC!$E$22*(1+$K$6)))","v":0},{"$f":"((LCC!$E$19*(LCC!$E$21/100))*(LCC!$E$22*(1+$L$6)))","v":0},{"$f":"((LCC!$E$19*(LCC!$E$21/100))*(LCC!$E$22*(1+$M$6)))","v":0},{"$f":"((LCC!$E$19*(LCC!$E$21/100))*(LCC!$E$22*(1+$N$6)))","v":0},{"$f":"SUM(Y4:INDEX(Y4:AI4,LCC!$E$6))","v":0},null,"prodotto 1",{"$f":"((LCC!$E$19*(LCC!$E$25/100))*LCC!$E$26)","v":0},{"$f":"((LCC!$E$19*(LCC!$E$25/100))*(LCC!$E$26*(1+$E$6)))","v":0},{"$f":"((LCC!$E$19*(LCC!$E$25/100))*(LCC!$E$26*(1+$F$6)))","v":0},{"$f":"((LCC!$E$19*(LCC!$E$25/100))*(LCC!$E$26*(1+$G$6)))","v":0},{"$f":"((LCC!$E$19*(LCC!$E$25/100))*(LCC!$E$26*(1+$H$6)))","v":0},{"$f":"((LCC!$E$19*(LCC!$E$25/100))*(LCC!$E$26*(1+$I$6)))","v":0},{"$f":"((LCC!$E$19*(LCC!$E$25/100))*(LCC!$E$26*(1+$J$6)))","v":0},{"$f":"((LCC!$E$19*(LCC!$E$25/100))*(LCC!$E$26*(1+$K$6)))","v":0},{"$f":"((LCC!$E$19*(LCC!$E$25/100))*(LCC!$E$26*(1+$L$6)))","v":0},{"$f":"((LCC!$E$19*(LCC!$E$25/100))*(LCC!$E$26*(1+$M$6)))","v":0},{"$f":"((LCC!$E$19*(LCC!$E$25/100))*(LCC!$E$26*(1+$N$6)))","v":0},{"$f":"SUM(AM4:INDEX(AM4:AW4,LCC!$E$6))","v":0}]
[null,null,"% rispetto anni prec",null,{"$f":"(E4-D4)/D4","v":-3.779134641750817E-2},{"$f":"(F4-E4)/E4","v":-1.3799993905418773E-2},5.4846285916513031E-4,1.0502296162006696E-2,2.1717845714667276E-2,1.6966356987284215E-2,1.8744374468085159E-2,2.0066821682133404E-2,1.3690042838056634E-2,1.2946987645307556E-2,null,null,null,null,null,null,null,null,null,"prodotto 2",{"$f":"((LCC!$G$19*(LCC!$G$21/100))*LCC!$G$22)","v":0},{"$f":"((LCC!$G$19*(LCC!$G$21/100))*(LCC!$G$22*(1+$E$6)))","v":0},{"$f":"((LCC!$G$19*(LCC!$G$21/100))*(LCC!$G$22*(1+$F$6)))","v":0},{"$f":"((LCC!$G$19*(LCC!$G$21/100))*(LCC!$G$22*(1+G$6)))","v":0},{"$f":"((LCC!$G$19*(LCC!$G$21/100))*(LCC!$G$22*(1+H$6)))","v":0},{"$f":"((LCC!$G$19*(LCC!$G$21/100))*(LCC!$G$22*(1+I$6)))","v":0},{"$f":"((LCC!$G$19*(LCC!$G$21/100))*(LCC!$G$22*(1+J$6)))","v":0},{"$f":"((LCC!$G$19*(LCC!$G$21/100))*(LCC!$G$22*(1+K$6)))","v":0},{"$f":"((LCC!$G$19*(LCC!$G$21/100))*(LCC!$G$22*(1+L$6)))","v":0},{"$f":"((LCC!$G$19*(LCC!$G$21/100))*(LCC!$G$22*(1+M$6)))","v":0},{"$f":"((LCC!$G$19*(LCC!$G$21/100))*(LCC!$G$22*(1+N$6)))","v":0},{"$f":"SUM(Y5:INDEX(Y5:AI5,LCC!$E$6))","v":0},null,"prodotto 2",{"$f":"((LCC!$G$19*(LCC!$G$25/100))*LCC!$G$26)","v":0},{"$f":"((LCC!$G$19*(LCC!$G$25/100))*(LCC!$G$26*(1+$E$6)))","v":0},{"$f":"((LCC!$G$19*(LCC!$G$25/100))*(LCC!$G$26*(1+$F$6)))","v":0},{"$f":"((LCC!$G$19*(LCC!$G$25/100))*(LCC!$G$26*(1+$G$6)))","v":0},{"$f":"((LCC!$G$19*(LCC!$G$25/100))*(LCC!$G$26*(1+$H$6)))","v":0},{"$f":"((LCC!$G$19*(LCC!$G$25/100))*(LCC!$G$26*(1+$I$6)))","v":0},{"$f":"((LCC!$G$19*(LCC!$G$25/100))*(LCC!$G$26*(1+$J$6)))","v":0},{"$f":"((LCC!$G$19*(LCC!$G$25/100))*(LCC!$G$26*(1+$K$6)))","v":0},{"$f":"((LCC!$G$19*(LCC!$G$25/100))*(LCC!$G$26*(1+$L$6)))","v":0},{"$f":"((LCC!$G$19*(LCC!$G$25/100))*(LCC!$G$26*(1+$M$6)))","v":0},{"$f":"((LCC!$G$19*(LCC!$G$25/100))*(LCC!$G$26*(1+$N$6)))","v":0},{"$f":"SUM(AM5:INDEX(AM5:AW5,LCC!$E$6))","v":0}]
[null,null,"% cumulativa",null,{"$f":"E5","v":-3.779134641750817E-2},{"$f":"F5+E6","v":-5.1591340322926942E-2},{"$f":"G5+F6","v":-5.1042877463761814E-2},-4.054058130175512E-2,-1.8822735587087844E-2,-1.8563785998036292E-3,1.6887995868281529E-2,3.6954817550414937E-2,5.0644860388471574E-2,6.3591848033779125E-2,null,null,null,null,null,null,null,null,null,"prodotto 3",{"$f":"((LCC!$I$19*(LCC!$I$21/100))*LCC!$I$22)","v":0},{"$f":"((LCC!$I$19*(LCC!$I$21/100))*(LCC!$I$22*(1+$E$6)))","v":0},{"$f":"((LCC!$I$19*(LCC!$I$21/100))*(LCC!$I$22*(1+$F$6)))","v":0},{"$f":"((LCC!$I$19*(LCC!$I$21/100))*(LCC!$I$22*(1+G$6)))","v":0},{"$f":"((LCC!$I$19*(LCC!$I$21/100))*(LCC!$I$22*(1+H$6)))","v":0},{"$f":"((LCC!$I$19*(LCC!$I$21/100))*(LCC!$I$22*(1+I$6)))","v":0},{"$f":"((LCC!$I$19*(LCC!$I$21/100))*(LCC!$I$22*(1+J$6)))","v":0},{"$f":"((LCC!$I$19*(LCC!$I$21/100))*(LCC!$I$22*(1+K$6)))","v":0},{"$f":"((LCC!$I$19*(LCC!$I$21/100))*(LCC!$I$22*(1+L$6)))","v":0},{"$f":"((LCC!$I$19*(LCC!$I$21/100))*(LCC!$I$22*(1+M$6)))","v":0},{"$f":"((LCC!$I$19*(LCC!$I$21/100))*(LCC!$I$22*(1+N$6)))","v":0},{"$f":"SUM(Y6:INDEX(Y6:AI6,LCC!$E$6))","v":0},null,"prodotto 3",{"$f":"((LCC!$I$19*(LCC!$I$25/100))*LCC!$I$26)","v":0},{"$f":"((LCC!$I$19*(LCC!$I$25/100))*(LCC!$I$26*(1+$E$6)))","v":0},{"$f":"((LCC!$I$19*(LCC!$I$25/100))*(LCC!$I$26*(1+$F$6)))","v":0},{"$f":"((LCC!$I$19*(LCC!$I$25/100))*(LCC!$I$26*(1+$G$6)))","v":0},{"$f":"((LCC!$I$19*(LCC!$I$25/100))*(LCC!$I$26*(1+$H$6)))","v":0},{"$f":"((LCC!$I$19*(LCC!$I$25/100))*(LCC!$I$26*(1+$I$6)))","v":0},{"$f":"((LCC!$I$19*(LCC!$I$25/100))*(LCC!$I$26*(1+$J$6)))","v":0},{"$f":"((LCC!$I$19*(LCC!$I$25/100))*(LCC!$I$26*(1+$K$6)))","v":0},{"$f":"((LCC!$I$19*(LCC!$I$25/100))*(LCC!$I$26*(1+$L$6)))","v":0},{"$f":"((LCC!$I$19*(LCC!$I$25/100))*(LCC!$I$26*(1+$M$6)))","v":0},{"$f":"((LCC!$I$19*(LCC!$I$25/100))*(LCC!$I$26*(1+$N$6)))","v":0},{"$f":"SUM(AM6:INDEX(AM6:AW6,LCC!$E$6))","v":0}]
{"$rows_left_out":92}
{"sheet":"calcoli","index":4,"n_rows":59,"n_cols":16,"rows_kept":59,"cut":false,"hidden":true,"merged":[]}
["FOR CALCULATIONS ONLY - DO NOT AMEND!"]
[]
[null,null,null,"prodotto 1","prodotto 2","prodotto 3","prodotto 4","prodotto 5","prodotto 6","prodotto 7","prodotto 8","prodotto 9","prodotto 10"]
[null,null,"tipo di carburante",{"$f":"MATCH(LCC!E20,$B$26:$B$38,0)","v":{"$error":"#N/A"}},{"$f":"MATCH(LCC!G20,$B$26:$B$38,0)","v":{"$error":"#N/A"}},{"$f":"MATCH(LCC!I20,$B$26:$B$38,0)","v":{"$error":"#N/A"}},{"$f":"MATCH(LCC!K20,$B$26:$B$38,0)","v":{"$error":"#N/A"}},{"$f":"MATCH(LCC!M20,$B$26:$B$38,0)","v":{"$error":"#N/A"}},{"$f":"MATCH(LCC!O20,$B$26:$B$38,0)","v":{"$error":"#N/A"}},{"$f":"MATCH(LCC!Q20,$B$26:$B$38,0)","v":{"$error":"#N/A"}},{"$f":"MATCH(LCC!S20,$B$26:$B$38,0)","v":{"$error":"#N/A"}},{"$f":"MATCH(LCC!U20,$B$26:$B$38,0)","v":{"$error":"#N/A"}},{"$f":"MATCH(LCC!W20,$B$26:$B$38,0)","v":{"$error":"#N/A"}}]
[null,null,"tipo di carburante 2",{"$f":"IF(CELL(\"contents\",LCC!E24)>0,MATCH(LCC!E24,$B$26:$B$38,0),0)","v":0},{"$f":"IF(CELL(\"contents\",LCC!G24)>0,MATCH(LCC!G24,$B$26:$B$38,0),0)","v":0},{"$f":"IF(CELL(\"contents\",LCC!I24)>0,MATCH(LCC!I24,$B$26:$B$38,0),0)","v":0},{"$f":"IF(CELL(\"contents\",LCC!K24)>0,MATCH(LCC!K24,$B$26:$B$38,0),0)","v":0},{"$f":"IF(CELL(\"contents\",LCC!M24)>0,MATCH(LCC!M24,$B$26:$B$38,0),0)","v":0},{"$f":"IF(CELL(\"contents\",LCC!O24)>0,MATCH(LCC!O24,$B$26:$B$38,0),0)","v":0},{"$f":"IF(CELL(\"contents\",LCC!Q24)>0,MATCH(LCC!Q24,$B$26:$B$38,0),0)","v":0},{"$f":"IF(CELL(\"contents\",LCC!S24)>0,MATCH(LCC!S24,$B$26:$B$38,0),0)","v":0},{"$f":"IF(CELL(\"contents\",LCC!U24)>0,MATCH(LCC!U24,$B$26:$B$38,0),0)","v":0},{"$f":"IF(CELL(\"contents\",LCC!W24)>0,MATCH(LCC!W24,$B$26:$B$38,0),0)","v":0}]
[null,null,"carburante di riferimento (1 = diesel, 2 = benzina)",{"$f":"IF(LCC!E59>0,IF(LCC!E59=\"Diesel\",1,2),0)","v":0},{"$f":"IF(LCC!G59>0,IF(LCC!G59=\"Diesel\",1,2),0)","v":0},{"$f":"IF(LCC!I59>0,IF(LCC!I59=\"Diesel\",1,2),0)","v":0},{"$f":"IF(LCC!K59>0,IF(LCC!K59=\"Diesel\",1,2),0)","v":0},{"$f":"IF(LCC!M59>0,IF(LCC!M59=\"Diesel\",1,2),0)","v":0},{"$f":"IF(LCC!O59>0,IF(LCC!O59=\"Diesel\",1,2),0)","v":0},{"$f":"IF(LCC!Q59>0,IF(LCC!Q59=\"Diesel\",1,2),0)","v":0},{"$f":"IF(LCC!S59>0,IF(LCC!S59=\"Diesel\",1,2),0)","v":0},{"$f":"IF(LCC!U59>0,IF(LCC!U59=\"Diesel\",1,2),0)","v":0},{"$f":"IF(LCC!W59>0,IF(LCC!W59=\"Diesel\",1,2),0)","v":0}]
{"$rows_left_out":54}
{"sheet":"esempio","index":5,"n_rows":108,"n_cols":14,"rows_kept":108,"cut":false,"hidden":true,"merged":[[68,2,68,3],[61,15,61,16],[62,15,62,16],[63,15,63,16],[66,15,66,16],[67,2,67,3],[67,15,67,16]]}
[]
[null,null,null,"VEICOLI - CALCOLATORE LCC"]
[null,null,null,"completa riempiendo solo le celle bianche "]
[]
[null,"CONDIZIONI GENERALI"]
[null,null,"lunghezza contratto","anno",10,null,{"$f":"E6","v":10},null,{"$f":"E6","v":10},null,{"$f":"E6","v":10},null,null,{"$f":"F6","v":0}]
{"$rows_left_out":103}
{"sheet":"calcolo esempio","index":6,"n_rows":59,"n_cols":42,"rows_kept":59,"cut":false,"hidden":true,"merged":[]}
["FOR CALCULATIONS ONLY - DO NOT AMEND!",null,null,null,null,null,null,null,null,null,null,null,null,null,null,"SINGLE FUEL TIME SERIES",null,null,null,null,null,null,null,null,null,null,null,null,"Fuel 1\nTime Series","SECOND FUEL TIME SERIES"]
[]
[null,null,null,"Product 1","Product 2","Product 3","Product 4","Product 5",null,null,null,null,null,null,null,"DIESEL",2014,2015,2016,2017,2018,2019,2020,2021,2022,2023,2024,"Total fuel price for period",null,"DIESEL",2014,2015,2016,2017,2018,2019,2020,2021,2022,2023,2024,"Total fuel price for period"]
[null,null,"tipo di carburante",{"$f":"MATCH(esempio!E20,$B$26:$B$38,0)","v":1},{"$f":"MATCH(esempio!G20,$B$26:$B$38,0)","v":1},{"$f":"MATCH(esempio!I20,$B$26:$B$38,0)","v":7},{"$f":"MATCH(esempio!K20,$B$26:$B$38,0)","v":{"$error":"#N/A"}},{"$f":"MATCH(esempio!M20,$B$26:$B$38,0)","v":{"$error":"#N/A"}},null,null,null,null,null,null,null,"Product 1",{"$f":"((esempio!$E$19*(esempio!$E$21/100))*esempio!$E$22)","v":40894.400000000001},{"$f":"((esempio!$E$19*(esempio!$E$21/100))*(esempio!$E$22*(1+'prezzi combustibile'!$E$6)))","v":39348.945563063855},{"$f":"((esempio!$E$19*(esempio!$E$21/100))*(esempio!$E$22*(1+'prezzi combustibile'!$F$6)))","v":38784.603092298101},{"$f":"((esempio!$E$19*(esempio!$E$21/100))*(esempio!$E$22*(1+'prezzi combustibile'!$G$6)))","v":38807.032151845939},{"$f":"((esempio!$E$19*(esempio!$E$21/100))*(esempio!$E$22*(1+'prezzi combustibile'!$H$6)))","v":39236.517252013509},{"$f":"((esempio!$E$19*(esempio!$E$21/100))*(esempio!$E$22*(1+'prezzi combustibile'!$I$6)))","v":40124.655521807399},{"$f":"((esempio!$E$19*(esempio!$E$21/100))*(esempio!$E$22*(1+'prezzi combustibile'!$J$6)))","v":40818.484510988194},{"$f":"((esempio!$E$19*(esempio!$E$21/100))*(esempio!$E$22*(1+'prezzi combustibile'!$K$6)))","v":41585.02445823585},{"$f":"((esempio!$E$19*(esempio!$E$21/100))*(esempio!$E$22*(1+'prezzi combustibile'!$L$6)))","v":42405.645090833677},{"$f":"((esempio!$E$19*(esempio!$E$21/100))*(esempio!$E$22*(1+'prezzi combustibile'!$M$6)))","v":42965.491178670309},{"$f":"((esempio!$E$19*(esempio!$E$21/100))*(esempio!$E$22*(1+'prezzi combustibile'!$N$6)))","v":43494.950470232572},{"$f":"SUM(Q4:INDEX(Q4:AA4,esempio!$E$6))","v":404970.79881975683},null,"Product 1",{"$f":"((esempio!$E$19*(esempio!$E$25/100))*esempio!$E$26)","v":0},{"$f":"((esempio!$E$19*(esempio!$E$25/100))*(esempio!$E$26*(1+'prezzi combustibile'!$E$6)))","v":0},{"$f":"((esempio!$E$19*(esempio!$E$25/100))*(esempio!$E$26*(1+'prezzi combustibile'!$F$6)))","v":0},{"$f":"((esempio!$E$19*(esempio!$E$25/100))*(esempio!$E$26*(1+'prezzi combustibile'!$G$6)))","v":0},{"$f":"((esempio!$E$19*(esempio!$E$25/100))*(esempio!$E$26*(1+'prezzi combustibile'!$H$6)))","v":0},{"$f":"((esempio!$E$19*(esempio!$E$25/100))*(esempio!$E$26*(1+'prezzi combustibile'!$I$6)))","v":0},{"$f":"((esempio!$E$19*(esempio!$E$25/100))*(esempio!$E$26*(1+'prezzi combustibile'!$J$6)))","v":0},{"$f":"((esempio!$E$19*(esempio!$E$25/100))*(esempio!$E$26*(1+$K$6)))","v":0},{"$f":"((esempio!$E$19*(esempio!$E$25/100))*(esempio!$E$26*(1+$L$6)))","v":0},{"$f":"((esempio!$E$19*(esempio!$E$25/100))*(esempio!$E$26*(1+$M$6)))","v":0},{"$f":"((esempio!$E$19*(esempio!$E$25/100))*(esempio!$E$26*(1+$N$6)))","v":0},{"$f":"SUM(AE4:INDEX(AE4:AO4,esempio!$E$6))","v":0}]
[null,null,"tipo di carburante 2",{"$f":"MATCH(esempio!E24,$B$26:$B$38,0)","v":{"$error":"#N/A"}},{"$f":"MATCH(esempio!G24,$B$26:$B$38,0)","v":2},{"$f":"MATCH(esempio!I24,$B$26:$B$38,0)","v":{"$error":"#N/A"}},{"$f":"MATCH(esempio!K24,$B$26:$B$38,0)","v":{"$error":"#N/A"}},{"$f":"MATCH(esempio!M24,$B$26:$B$38,0)","v":{"$error":"#N/A"}},null,null,null,null,null,null,null,"Product 2",{"$f":"((esempio!$G$19*(esempio!$G$21/100))*esempio!$G$22)","v":31817.599999999999},{"$f":"((esempio!$G$19*(esempio!$G$21/100))*(esempio!$G$22*(1+'prezzi combustibile'!$E$6)))","v":30615.170056226292},{"$f":"((esempio!$G$19*(esempio!$G$21/100))*(esempio!$G$22*(1+'prezzi combustibile'!$F$6)))","v":30176.087370141242},{"$f":"((esempio!$G$19*(esempio!$G$21/100))*(esempio!$G$22*(1+'prezzi combustibile'!$G$6)))","v":30193.538142009013},{"$f":"((esempio!$G$19*(esempio!$G$21/100))*(esempio!$G$22*(1+'prezzi combustibile'!$H$6)))","v":30527.696000373278},{"$f":"((esempio!$G$19*(esempio!$G$21/100))*(esempio!$G$22*(1+'prezzi combustibile'!$I$6)))","v":31218.705728184275},{"$f":"((esempio!$G$19*(esempio!$G$21/100))*(esempio!$G$22*(1+'prezzi combustibile'!$J$6)))","v":31758.534488262892},{"$f":"((esempio!$G$19*(esempio!$G$21/100))*(esempio!$G$22*(1+'prezzi combustibile'!$K$6)))","v":32354.935497338633},{"$f":"((esempio!$G$19*(esempio!$G$21/100))*(esempio!$G$22*(1+'prezzi combustibile'!$L$6)))","v":32993.413602892077},{"$f":"((esempio!$G$19*(esempio!$G$21/100))*(esempio!$G$22*(1+'prezzi combustibile'!$M$6)))","v":33428.997909896229},{"$f":"((esempio!$G$19*(esempio!$G$21/100))*(esempio!$G$22*(1+'prezzi combustibile'!$N$6)))","v":33840.939983999568},{"$f":"SUM(Q5:INDEX(Q5:AA5,esempio!$G$6))","v":315084.67879532394},null,"Product 2",{"$f":"((esempio!$G$19*(esempio!$G$25/100))*esempio!$G$26)","v":200000},{"$f":"((esempio!$G$19*(esempio!$G$25/100))*(esempio!$G$26*(1+'prezzi combustibile'!$E$6)))","v":192441.73071649836},{"$f":"((esempio!$G$19*(esempio!$G$25/100))*(esempio!$G$26*(1+'prezzi combustibile'!$F$6)))","v":189681.73193541463},{"$f":"((esempio!$G$19*(esempio!$G$25/100))*(esempio!$G$26*(1+'prezzi combustibile'!$G$6)))","v":189791.42450724763},{"$f":"((esempio!$G$19*(esempio!$G$25/100))*(esempio!$G$26*(1+'prezzi combustibile'!$H$6)))","v":191891.88373964897},{"$f":"((esempio!$G$19*(esempio!$G$25/100))*(esempio!$G$26*(1+'prezzi combustibile'!$I$6)))","v":196235.45288258244},{"$f":"((esempio!$G$19*(esempio!$G$25/100))*(esempio!$G$26*(1+'prezzi combustibile'!$J$6)))","v":199628.72428003929},{"$f":"((esempio!$G$19*(esempio!$G$25/100))*(esempio!$G$26*(1+$K$6)))","v":200000},{"$f":"((esempio!$G$19*(esempio!$G$25/100))*(esempio!$G$26*(1+$L$6)))","v":200000},{"$f":"((esempio!$G$19*(esempio!$G$25/100))*(esempio!$G$26*(1+$M$6)))","v":200000},{"$f":"((esempio!$G$19*(esempio!$G$25/100))*(esempio!$G$26*(1+$N$6)))","v":200000},{"$f":"SUM(AE5:INDEX(AE5:AO5,esempio!$E$6))","v":1959670.9480614313}]
[null,null,"carburante di riferimento (1 = diesel, 2 = benzina)",{"$f":"IF(esempio!E59>0,IF(esempio!E59=\"Diesel\",1,2),0)","v":1},{"$f":"IF(esempio!G59>0,IF(esempio!G59=\"Diesel\",1,2),0)","v":1},{"$f":"IF(esempio!I59>0,IF(esempio!I59=\"Diesel\",1,2),0)","v":0},{"$f":"IF(esempio!K59>0,IF(esempio!K59=\"Diesel\",1,2),0)","v":0},{"$f":"IF(esempio!M59>0,IF(esempio!M59=\"Diesel\",1,2),0)","v":0},null,null,null,null,null,null,null,"Product 3",{"$f":"((esempio!$I$19*(esempio!$I$21/100))*esempio!$I$22)","v":36000},{"$f":"((esempio!$I$19*(esempio!$I$21/100))*(esempio!$I$22*(1+'prezzi combustibile'!$E$6)))","v":34639.511528969706},{"$f":"((esempio!$I$19*(esempio!$I$21/100))*(esempio!$I$22*(1+'prezzi combustibile'!$F$6)))","v":34142.711748374633},{"$f":"((esempio!$I$19*(esempio!$I$21/100))*(esempio!$I$22*(1+'prezzi combustibile'!$G$6)))","v":34162.456411304578},{"$f":"((esempio!$I$19*(esempio!$I$21/100))*(esempio!$I$22*(1+'prezzi combustibile'!$H$6)))","v":34540.539073136817},{"$f":"((esempio!$I$19*(esempio!$I$21/100))*(esempio!$I$22*(1+'prezzi combustibile'!$I$6)))","v":35322.381518864837},{"$f":"((esempio!$I$19*(esempio!$I$21/100))*(esempio!$I$22*(1+'prezzi combustibile'!$J$6)))","v":35933.170370407068},{"$f":"((esempio!$I$19*(esempio!$I$21/100))*(esempio!$I$22*(1+'prezzi combustibile'!$K$6)))","v":36607.96785125813},{"$f":"((esempio!$I$19*(esempio!$I$21/100))*(esempio!$I$22*(1+'prezzi combustibile'!$L$6)))","v":37330.373431814936},{"$f":"((esempio!$I$19*(esempio!$I$21/100))*(esempio!$I$22*(1+'prezzi combustibile'!$M$6)))","v":37823.21497398497},{"$f":"((esempio!$I$19*(esempio!$I$21/100))*(esempio!$I$22*(1+'prezzi combustibile'!$N$6)))","v":38289.306529216054},{"$f":"SUM(Q6:INDEX(Q6:AA6,esempio!$I$6))","v":356502.32690811565},null,"Product 3",{"$f":"((esempio!$I$19*(esempio!$I$25/100))*esempio!$I$26)","v":0},{"$f":"((esempio!$I$19*(esempio!$I$25/100))*(esempio!$I$26*(1+'prezzi combustibile'!$E$6)))","v":0},{"$f":"((esempio!$I$19*(esempio!$I$25/100))*(esempio!$I$26*(1+'prezzi combustibile'!$F$6)))","v":0},{"$f":"((esempio!$I$19*(esempio!$I$25/100))*(esempio!$I$26*(1+'prezzi combustibile'!$G$6)))","v":0},{"$f":"((esempio!$I$19*(esempio!$I$25/100))*(esempio!$I$26*(1+'prezzi combustibile'!$H$6)))","v":0},{"$f":"((esempio!$I$19*(esempio!$I$25/100))*(esempio!$I$26*(1+'prezzi combustibile'!$I$6)))","v":0},{"$f":"((esempio!$I$19*(esempio!$I$25/100))*(esempio!$I$26*(1+'prezzi combustibile'!$J$6)))","v":0},{"$f":"((esempio!$I$19*(esempio!$I$25/100))*(esempio!$I$26*(1+$K$6)))","v":0},{"$f":"((esempio!$I$19*(esempio!$I$25/100))*(esempio!$I$26*(1+$L$6)))","v":0},{"$f":"((esempio!$I$19*(esempio!$I$25/100))*(esempio!$I$26*(1+$M$6)))","v":0},{"$f":"((esempio!$I$19*(esempio!$I$25/100))*(esempio!$I$26*(1+$N$6)))","v":0},{"$f":"SUM(AE6:INDEX(AE6:AO6,esempio!$E$6))","v":0}]
{"$rows_left_out":53}